{"text_format":"1","workbook":"xlsx","n_sheets":10,"sheets":["Atlantique Pré-pension","PM 60-64","rente","Resultat","GUIDE ","Module ","calcu ","CALCUL","Resultat1","Feuil2"],"not_rendered":{"charts":0,"images":1,"macros":1,"external_links":3,"defined_names":57,"comments":3,"pivot_tables":0},"unopened":[],"bounds":{"document_bytes":16777216,"sheet_cells":100000,"rows_first":2000,"rows_last":500,"rows_between":2000,"halvings":0,"cell_chars":16384,"cell_head_chars":4096},"cells_cut":0,"cells_raw":0,"read":"whole","date_system":"1900"}

{"sheet":"Atlantique Pré-pension","index":0,"n_rows":207,"n_cols":31,"rows_kept":207,"cut":false,"hidden":true,"merged":[[20,3,20,4],[22,3,22,4],[20,10,20,11]]}
["Police","xxxxxxxxxx",null,"ID","xxxxxx",null,null,"Date effet","2011-06-01",null,null,null,"Differe",15,"Nbre année de cotis pr cap dec",{"$f":"12*MIN(N1,10)","v":120}]
[null,null,null,null,null,null,null,null,null,null,null,null,"Vieillissement",0]
[null,"Taux d'interet",null,null,null,null,"Frais d'acquisition",null,null,null,"Frais de Gestion",null,null,null,"Autres"]
[null,"taux interet technique",3.5000000000000003E-2,null,null,null,"taux de frais d'acquisition",0.02,null,null,"taux frais fract. mens",0,null,null,"date de naissance","1975-12-16",null,null,null,null,null,null,null,null,{"$f":"C4/12","v":2.9166666666666668E-3},{"$f":"C5/12","v":2.3991666666666671E-3}]
[null,"taux interet reel",{"$f":"C4-L6*(1+C4)","v":2.8790000000000003E-2},null,null,null,"duree maximale pr calcul",20,null,null,"taux frais gestion prime",0.03,null,null,"taux majoration qx",0]
[null,"taux interet oper deces",3.5000000000000003E-2,null,null,null,"Escompte?","O",null,null,"taux frais gestion PM",6.0000000000000001E-3,null,null,"date de calcul PM",{"$f":"DATE(YEAR(I1)+N1,MONTH(I1),DAY(I1)-1)","v":"2026-05-31"}]
[null,null,{"$f":"C5/12","v":2.3991666666666671E-3},null,"Cotisation",12000,null,null,null,null,"taux frais gestion deces",0.2,null,null,"Capital deces",{"$f":"F7*P1","v":1440000},null,null,null,null,null,null,null,null,{"$f":"1+Y4","v":1.0029166666666667},{"$f":"1+Z4","v":1.0023991666666667},null,{"$f":"1-L5-H4","v":0.95}]
[null,"mensuel composé",{"$f":"(1+C5)^(1/12)-1","v":2.3680790130307106E-3},null,"Capital au Terme",{"$f":"P206","v":2397495.4723918228},null,null,null,null,"Assiette gestion contrat","PHT",null,null,"Doublement deces accidentel",0,null,null,null,null,null,null,null,null,{"$f":"Y7^12","v":1.0355669529459706},{"$f":"Z7^12","v":1.0291729506221801}]
[]
[]
[]
[]
[]
[null,"taux interet technique",3.5000000000000003E-2]
[null,"taux interet reel",{"$f":"C14-L16*(1+C14)","v":3.5000000000000003E-2}]
[null,"taux interet oper deces",3.5000000000000003E-2]
[null,null,{"$f":"C15/12","v":2.9166666666666668E-3}]
[null,"mensuel composé",{"$f":"(1+C15)^(1/12)-1","v":2.8708987190766422E-3}]
[]
[]
["Nombre de Mois de service de la rente",null,null,18,null,null,null,"Capital consttitif de la rente",null,null,{"$f":"D23*(1-(1+C18)^(-D21))/C18","v":1751833.2418455002}]
[]
["Montant mesuel de la Rente",null,null,100000]
[]
[null,null,null,null,null,null,null,null,null,null,null,null,null,null,null,null,null,null,null,null,null,null,null,null,{"$f":"Y8-1","v":3.5566952945970565E-2},{"$f":"Z8-1","v":2.9172950622180061E-2},null,{"$f":"(Y7^60)-1","v":0.19094282914289407},{"$f":"AB25/Y4","v":65.466112848992253},{"$f":"0.95*Y7*6000","v":5716.625}]
["N°","Date réception","Date échéance","Cotis","Cions","Fract.","Gestion","Cot a investir","Age","qx annuel","Prime dec comm annuelle","Prime dec com mens","Cot epargne",null,"PM debut","PM Fin",null,null,null,null,null,null,null,null,{"$f":"Y25/Y4","v":12.194383867189908},{"$f":"Z25/Z4","v":12.159618182221628},null,null,null,{"$f":"AD25*AC25","v":374245.21736537036}]
[1,{"$f":"I1","v":"2011-06-01"},{"$f":"B27","v":"2011-06-01"},{"$f":"$F$7","v":12000},{"$f":"IF($H$6=\"O\",IF(12*(YEAR(C27)-YEAR($I$1))+MONTH(C27)-MONTH($I$1)+1>12,0,D27*$H$4*MIN($H$5,$N$1)),D27*$H$4)","v":3600},{"$f":"IF($L$8=\"Ppure\",IF((12*YEAR(C27)+MONTH(C27))-(12*YEAR($P$6)+MONTH($P$6))>1,0,ROUND((D27-E27)*$L$4/(1+$L$4+$L$5),0)),D27*$L$4)","v":0},{"$f":"IF($L$8=\"Ppure\",IF((12*YEAR(C27)+MONTH(C27))-(12*YEAR($P$6)+MONTH($P$6))>1,0,ROUND((D27-E27)*$L$5/(1+$L$4+$L$5),0)),D27*$L$5)","v":360},{"$f":"ROUND(D27-E27-F27-G27,1)","v":8040},{"$f":"INT(YEAR(C27)-YEAR($P$4)+$N$2+(MONTH(C27)-MONTH($P$4))/12)","v":35},{"$f":"INDEX('PM 60-64'!$A$2:$E$107,I27+1,4)","v":2.5847280334728032E-3},{"$f":"ROUND((J27*(1+$P$5)*(1+$C$6)^(-0.5)+$P$8)*(1+$L$7)*$P$7,0)","v":4390},{"$f":"ROUND(-K27*(1+$L$4)/12,0)","v":-366},{"$f":"H27+L27","v":7674},null,0,{"$f":"M27*(1+$C$8)","v":7692.1726383459973},null,null,null,null,null,null,null,null,{"$f":"Y26*Y7","v":12.229950820135878},{"$f":"Z26*Z7","v":12.188791132843809},null,{"$f":"S27/H27","v":0},null,null,1]
[2,{"$f":"DATE(YEAR(B27),MONTH(B27)+1,DAY(B27))","v":"2011-07-01"},{"$f":"B28","v":"2011-07-01"},12000,{"$f":"IF($H$6=\"O\",IF(12*(YEAR(C28)-YEAR($I$1))+MONTH(C28)-MONTH($I$1)+1>12,0,D28*$H$4*MIN($H$5,$N$1)),D28*$H$4)","v":3600},{"$f":"IF($L$8=\"Ppure\",IF((12*YEAR(C28)+MONTH(C28))-(12*YEAR($P$6)+MONTH($P$6))>1,0,ROUND((D28-E28)*$L$4/(1+$L$4+$L$5),0)),D28*$L$4)","v":0},{"$f":"IF($L$8=\"Ppure\",IF((12*YEAR(C28)+MONTH(C28))-(12*YEAR($P$6)+MONTH($P$6))>1,0,ROUND((D28-E28)*$L$5/(1+$L$4+$L$5),0)),D28*$L$5)","v":360},8040,35,{"$f":"INDEX('PM 60-64'!$A$2:$E$107,I28+1,4)","v":2.5847280334728032E-3},4390,{"$f":"ROUND(-K28*(1+$L$4)/12,0)","v":-366},7674,null,{"$f":"P27","v":7692.1726383459973},{"$f":"(O28+M28)*(1+$C$8)","v":15402.560949281471},null,null,null,null,null,null,null,null,{"$f":"$H$27*Y27","v":98328.804593892462},{"$f":"$H$27*Z27","v":97997.880708064229},88815,null,null,null,2]
[3,{"$f":"DATE(YEAR(B28),MONTH(B28)+1,DAY(B28))","v":"2011-08-01"},"2011-08-01",12000,3600,0,360,8040,35,{"$f":"INDEX('PM 60-64'!$A$2:$E$107,I29+1,4)","v":2.5847280334728032E-3},4390,{"$f":"ROUND(-K29*(1+$L$4)/12,0)","v":-366},7674,null,{"$f":"P28","v":15402.560949281471},23131.208068958385,null,null,null,null,null,null,null,null,null,null,null,null,null,null,3]
[4,"2011-09-01","2011-09-01",12000,3600,0,360,8040,35,{"$f":"INDEX('PM 60-64'!$A$2:$E$107,I30+1,4)","v":2.5847280334728032E-3},4390,-366,7674,null,23131.208068958385,30878.157235678529,null,null,null,null,null,null,null,null,null,null,null,null,null,null,4]
[5,"2011-10-01","2011-10-01",12000,3600,0,360,8040,35,{"$f":"INDEX('PM 60-64'!$A$2:$E$107,I31+1,4)","v":2.5847280334728032E-3},4390,-366,7674,null,30878.157235678529,38643.451790135405,null,null,null,null,null,null,null,null,null,null,null,null,null,null,5]
[6,"2011-11-01","2011-11-01",12000,3600,0,360,8040,35,{"$f":"INDEX('PM 60-64'!$A$2:$E$107,I32+1,4)","v":2.5847280334728032E-3},4390,-366,7674,null,38643.451790135405,46427.135175656687,null,null,null,null,null,null,null,null,null,null,null,null,null,null,6]
[7,"2011-12-01","2011-12-01",12000,3600,0,360,8040,36,{"$f":"INDEX('PM 60-64'!$A$2:$E$107,I33+1,4)","v":2.7914331733834433E-3},4741,-395,7645,null,46427.135175656687,54200.182264155919,null,null,null,null,null,null,null,null,null,null,null,null,null,null,7]
[8,"2012-01-01","2012-01-01",12000,3600,0,360,8040,36,{"$f":"INDEX('PM 60-64'!$A$2:$E$107,I34+1,4)","v":2.7914331733834433E-3},4741,-395,7645,null,54200.182264155919,61991.636542332722,null,null,null,null,null,null,null,null,null,null,null,null,null,null,8]
[9,"2012-02-01","2012-02-01",12000,3600,0,360,8040,36,{"$f":"INDEX('PM 60-64'!$A$2:$E$107,I35+1,4)","v":2.7914331733834433E-3},4741,-395,7645,null,61991.636542332722,69801.541599866672,null,null,null,null,null,null,null,null,null,null,null,null,null,null,9]
[10,"2012-03-01","2012-03-01",12000,3600,0,360,8040,36,{"$f":"INDEX('PM 60-64'!$A$2:$E$107,I36+1,4)","v":2.7914331733834433E-3},4741,-395,7645,null,69801.541599866672,77629.941129661122,null,null,null,null,null,null,null,null,null,null,null,null,null,null,10]
[11,"2012-04-01","2012-04-01",12000,3600,0,360,8040,36,{"$f":"INDEX('PM 60-64'!$A$2:$E$107,I37+1,4)","v":2.7914331733834433E-3},4741,-395,7645,null,77629.941129661122,85476.878928087695,null,null,null,null,null,null,null,null,null,null,null,null,null,null,11]
[12,"2012-05-01","2012-05-01",12000,3600,0,360,8040,36,{"$f":"INDEX('PM 60-64'!$A$2:$E$107,I38+1,4)","v":2.7914331733834433E-3},4741,-395,7645,null,85476.878928087695,93342.398895231294,null,null,null,null,null,null,null,{"$f":"SUM(H27:H38)","v":96480},{"$f":"SUM(S27:S38)","v":0},{"$f":"SUM(D27:D38)","v":144000},{"$f":"SUM(E27:E38)","v":43200},{"$f":"SUM(F27:F38)","v":0},{"$f":"SUM(G27:G38)","v":4320},null,12]
[13,"2012-06-01","2012-06-01",12000,0,0,360,11640,36,{"$f":"INDEX('PM 60-64'!$A$2:$E$107,I39+1,4)","v":2.7914331733834433E-3},4741,-395,11245,null,93342.398895231294,104835.07011958257,null,null,null,null,null,null,null,null,{"$f":"SUM(W27:W38)","v":0},null,{"$f":"Z38-AA38","v":100800},null,null,null,13]
[14,"2012-07-01","2012-07-01",12000,0,0,360,11640,36,{"$f":"INDEX('PM 60-64'!$A$2:$E$107,I40+1,4)","v":2.7914331733834433E-3},4741,-395,11245,null,104835.07011958257,116354.95689746388,null,null,null,null,null,null,null,null,null,null,{"$f":"AA39-AB38","v":100800},null,null,null,14]
[15,"2012-08-01","2012-08-01",12000,0,0,360,11640,36,{"$f":"INDEX('PM 60-64'!$A$2:$E$107,I41+1,4)","v":2.7914331733834433E-3},4741,-395,11245,null,116354.95689746388,127902.12367745639,null,null,null,null,null,null,null,null,null,null,{"$f":"AA40-AC38","v":96480},null,null,null,15]
[16,"2012-09-01","2012-09-01",12000,0,0,360,11640,36,{"$f":"INDEX('PM 60-64'!$A$2:$E$107,I42+1,4)","v":2.7914331733834433E-3},4741,-395,11245,null,127902.12367745639,139476.63506076057,null,null,null,null,null,null,null,null,null,null,null,null,null,null,16]
[17,"2012-10-01","2012-10-01",12000,0,0,360,11640,36,{"$f":"INDEX('PM 60-64'!$A$2:$E$107,I43+1,4)","v":2.7914331733834433E-3},4741,-395,11245,null,139476.63506076057,151078.55580155764,null,null,null,null,null,null,null,null,null,null,null,null,null,null,17]
[18,"2012-11-01","2012-11-01",12000,0,0,360,11640,36,{"$f":"INDEX('PM 60-64'!$A$2:$E$107,I44+1,4)","v":2.7914331733834433E-3},4741,-395,11245,null,151078.55580155764,162707.95080737182,null,null,null,null,null,null,null,null,null,null,null,null,null,null,18]
[19,"2012-12-01","2012-12-01",12000,0,0,360,11640,37,{"$f":"INDEX('PM 60-64'!$A$2:$E$107,I45+1,4)","v":3.015405061002023E-3},5122,-427,11213,null,162707.95080737182,174332.80936090511,null,null,null,null,null,null,null,null,null,null,null,null,null,null,19]
[20,"2013-01-01","2013-01-01",12000,0,0,360,11640,37,{"$f":"INDEX('PM 60-64'!$A$2:$E$107,I46+1,4)","v":3.015405061002023E-3},5122,-427,11213,null,174332.80936090511,185985.19649800847,null,null,null,null,null,null,null,null,null,null,null,null,null,null,20]
[21,"2013-02-01","2013-02-01",12000,0,0,360,11640,37,{"$f":"INDEX('PM 60-64'!$A$2:$E$107,I47+1,4)","v":3.015405061002023E-3},5122,-427,11213,null,185985.19649800847,197665.17740854292,null,null,null,null,null,null,null,null,null,null,null,null,null,null,21]
[22,"2013-03-01","2013-03-01",12000,0,0,360,11640,37,{"$f":"INDEX('PM 60-64'!$A$2:$E$107,I48+1,4)","v":3.015405061002023E-3},5122,-427,11213,null,197665.17740854292,209372.8174367442,null,null,null,null,null,null,null,null,null,null,null,null,null,null,22]
[23,"2013-04-01","2013-04-01",12000,0,0,360,11640,37,{"$f":"INDEX('PM 60-64'!$A$2:$E$107,I49+1,4)","v":3.015405061002023E-3},5122,-427,11213,null,209372.8174367442,221108.18208158837,null,null,null,null,null,null,null,null,null,null,null,null,null,null,23]
[24,"2013-05-01","2013-05-01",12000,0,0,360,11640,37,{"$f":"INDEX('PM 60-64'!$A$2:$E$107,I50+1,4)","v":3.015405061002023E-3},5122,-427,11213,null,221108.18208158837,232871.33699715827,null,null,null,null,null,null,null,{"$f":"SUM(H39:H50)","v":139680},{"$f":"SUM(S39:S50)","v":0},{"$f":"SUM(D39:D50)","v":144000},{"$f":"SUM(E39:E50)","v":0},{"$f":"SUM(F39:F50)","v":0},{"$f":"SUM(G39:G50)","v":4320},null,24]
[25,"2013-06-01","2013-06-01",12000,0,0,360,11640,37,{"$f":"INDEX('PM 60-64'!$A$2:$E$107,I51+1,4)","v":3.015405061002023E-3},5122,-427,11213,null,232871.33699715827,244662.34799301077,null,null,null,null,null,null,null,null,{"$f":"Y38+Y50","v":0},null,null,null,null,null,25]
[26,"2013-07-01","2013-07-01",12000,0,0,360,11640,37,{"$f":"INDEX('PM 60-64'!$A$2:$E$107,I52+1,4)","v":3.015405061002023E-3},5122,-427,11213,null,244662.34799301077,256481.28103454495,null,null,null,null,null,null,null,null,null,null,null,null,null,null,26]
[27,"2013-08-01","2013-08-01",12000,0,0,360,11640,37,{"$f":"INDEX('PM 60-64'!$A$2:$E$107,I53+1,4)","v":3.015405061002023E-3},5122,-427,11213,null,256481.28103454495,268328.20224337117,null,null,null,null,null,null,null,null,null,null,null,null,null,null,27]
[28,"2013-09-01","2013-09-01",12000,0,0,360,11640,37,{"$f":"INDEX('PM 60-64'!$A$2:$E$107,I54+1,4)","v":3.015405061002023E-3},5122,-427,11213,null,268328.20224337117,280203.17789768107,null,null,null,null,null,null,null,null,null,null,null,null,null,null,28]
[29,"2013-10-01","2013-10-01",12000,0,0,360,11640,37,{"$f":"INDEX('PM 60-64'!$A$2:$E$107,I55+1,4)","v":3.015405061002023E-3},5122,-427,11213,null,280203.17789768107,292106.27443261817,null,null,null,null,null,null,null,null,null,null,null,null,null,null,29]
[30,"2013-11-01","2013-11-01",12000,0,0,360,11640,37,{"$f":"INDEX('PM 60-64'!$A$2:$E$107,I56+1,4)","v":3.015405061002023E-3},5122,-427,11213,null,292106.27443261817,304037.55844064977,null,null,null,null,null,null,null,null,null,null,null,null,null,null,30]
[31,"2013-12-01","2013-12-01",12000,0,0,360,11640,38,{"$f":"INDEX('PM 60-64'!$A$2:$E$107,I57+1,4)","v":3.2611274243630364E-3},5539,-462,11178,null,304037.55844064977,315962.0137891738,null,null,null,null,null,null,null,null,null,null,null,null,null,null,31]
[32,"2014-01-01","2014-01-01",12000,0,0,360,11640,38,{"$f":"INDEX('PM 60-64'!$A$2:$E$107,I58+1,4)","v":3.2611274243630364E-3},5539,-462,11178,null,315962.0137891738,327914.70719015051,null,null,null,null,null,null,null,null,null,null,null,null,null,null,32]
[33,"2014-02-01","2014-02-01",12000,0,0,360,11640,38,{"$f":"INDEX('PM 60-64'!$A$2:$E$107,I59+1,4)","v":3.2611274243630364E-3},5539,-462,11178,null,327914.70719015051,339895.70551351929,null,null,null,null,null,null,null,null,null,null,null,null,null,null,33]
[34,"2014-03-01","2014-03-01",12000,0,0,360,11640,38,{"$f":"INDEX('PM 60-64'!$A$2:$E$107,I60+1,4)","v":3.2611274243630364E-3},5539,-462,11178,null,339895.70551351929,351905.07578757277,null,null,null,null,null,null,null,null,null,null,null,null,null,null,34]
[35,"2014-04-01","2014-04-01",12000,0,0,360,11640,38,{"$f":"INDEX('PM 60-64'!$A$2:$E$107,I61+1,4)","v":3.2611274243630364E-3},5539,-462,11178,null,351905.07578757277,363942.88519933197,null,null,null,null,null,null,null,null,null,null,null,null,null,null,35]
[36,"2014-05-01","2014-05-01",12000,0,0,360,11640,38,{"$f":"INDEX('PM 60-64'!$A$2:$E$107,I62+1,4)","v":3.2611274243630364E-3},5539,-462,11178,null,363942.88519933197,376009.20109492203,null,null,null,null,null,null,null,{"$f":"SUM(H51:H62)","v":139680},{"$f":"SUM(S51:S62)","v":0},null,null,null,null,null,36]
[37,"2014-06-01","2014-06-01",12000,0,0,360,11640,38,{"$f":"INDEX('PM 60-64'!$A$2:$E$107,I63+1,4)","v":3.2611274243630364E-3},5539,-462,11178,null,376009.20109492203,388104.09097994899,null,null,null,null,null,null,null,null,null,null,null,null,null,null,37]
[38,"2014-07-01","2014-07-01",12000,0,0,360,11640,38,{"$f":"INDEX('PM 60-64'!$A$2:$E$107,I64+1,4)","v":3.2611274243630364E-3},5539,-462,11178,null,388104.09097994899,400227.62251987762,null,null,null,null,null,null,null,null,null,null,null,null,null,null,38]
[39,"2014-08-01","2014-08-01",12000,0,0,360,11640,38,{"$f":"INDEX('PM 60-64'!$A$2:$E$107,I65+1,4)","v":3.2611274243630364E-3},5539,-462,11178,null,400227.62251987762,412379.86354040977,null,null,null,null,null,null,null,null,null,null,null,null,null,null,39]
[40,"2014-09-01","2014-09-01",12000,0,0,360,11640,38,{"$f":"INDEX('PM 60-64'!$A$2:$E$107,I66+1,4)","v":3.2611274243630364E-3},5539,-462,11178,null,412379.86354040977,424560.88202786393,null,null,null,null,null,null,null,null,null,null,null,null,null,null,40]
[41,"2014-10-01","2014-10-01",12000,0,0,360,11640,38,{"$f":"INDEX('PM 60-64'!$A$2:$E$107,I67+1,4)","v":3.2611274243630364E-3},5539,-462,11178,null,424560.88202786393,436770.74612955557,null,null,null,null,null,null,null,null,null,null,null,null,null,null,41]
[42,"2014-11-01","2014-11-01",12000,0,0,360,11640,38,{"$f":"INDEX('PM 60-64'!$A$2:$E$107,I68+1,4)","v":3.2611274243630364E-3},5539,-462,11178,null,436770.74612955557,449009.52415417839,null,null,null,null,null,null,null,null,null,null,null,null,null,null,42]
[43,"2014-12-01","2014-12-01",12000,0,0,360,11640,39,{"$f":"INDEX('PM 60-64'!$A$2:$E$107,I69+1,4)","v":3.5279337053033218E-3},5992,-499,11141,null,449009.52415417839,461240.19695326296,null,null,null,null,null,null,null,null,null,null,null,null,null,null,43]
[44,"2015-01-01","2015-01-01",12000,0,0,360,11640,39,{"$f":"INDEX('PM 60-64'!$A$2:$E$107,I70+1,4)","v":3.5279337053033218E-3},5992,-499,11141,null,461240.19695326296,473499.8329519183,null,null,null,null,null,null,null,null,null,null,null,null,null,null,44]
[45,"2015-02-01","2015-02-01",12000,0,0,360,11640,39,{"$f":"INDEX('PM 60-64'!$A$2:$E$107,I71+1,4)","v":3.5279337053033218E-3},5992,-499,11141,null,473499.8329519183,485788.50073728949,null,null,null,null,null,null,null,null,null,null,null,null,null,null,45]
[46,"2015-03-01","2015-03-01",12000,0,0,360,11640,39,{"$f":"INDEX('PM 60-64'!$A$2:$E$107,I72+1,4)","v":3.5279337053033218E-3},5992,-499,11141,null,485788.50073728949,498106.26905894128,null,null,null,null,null,null,null,null,null,null,null,null,null,null,46]
[47,"2015-04-01","2015-04-01",12000,0,0,360,11640,39,{"$f":"INDEX('PM 60-64'!$A$2:$E$107,I73+1,4)","v":3.5279337053033218E-3},5992,-499,11141,null,498106.26905894128,510453.20682924299,null,null,null,null,null,null,null,null,null,null,null,null,null,null,47]
[48,"2015-05-01","2015-05-01",12000,0,0,360,11640,39,{"$f":"INDEX('PM 60-64'!$A$2:$E$107,I74+1,4)","v":3.5279337053033218E-3},5992,-499,11141,null,510453.20682924299,522829.38312375371,null,null,null,null,null,null,null,{"$f":"SUM(H63:H74)","v":139680},null,null,null,null,null,null,48]
[49,"2015-06-01","2015-06-01",12000,0,0,360,11640,39,{"$f":"INDEX('PM 60-64'!$A$2:$E$107,I75+1,4)","v":3.5279337053033218E-3},5992,-499,11141,null,522829.38312375371,535234.86718160904,null,null,null,null,null,null,null,null,null,null,null,null,null,null,49]
[50,"2015-07-01","2015-07-01",12000,0,0,360,11640,39,{"$f":"INDEX('PM 60-64'!$A$2:$E$107,I76+1,4)","v":3.5279337053033218E-3},5992,-499,11141,null,535234.86718160904,547669.72840590822,null,null,null,null,null,null,null,null,null,null,null,null,null,null,50]
[51,"2015-08-01","2015-08-01",12000,0,0,360,11640,39,{"$f":"INDEX('PM 60-64'!$A$2:$E$107,I77+1,4)","v":3.5279337053033218E-3},5992,-499,11141,null,547669.72840590822,560134.03636410262,null,null,null,null,null,null,null,null,null,null,null,null,null,null,51]
[52,"2015-09-01","2015-09-01",12000,0,0,360,11640,39,{"$f":"INDEX('PM 60-64'!$A$2:$E$107,I78+1,4)","v":3.5279337053033218E-3},5992,-499,11141,null,560134.03636410262,572627.8607883848,null,null,null,null,null,null,null,null,null,null,null,null,null,null,52]
[53,"2015-10-01","2015-10-01",12000,0,0,360,11640,39,{"$f":"INDEX('PM 60-64'!$A$2:$E$107,I79+1,4)","v":3.5279337053033218E-3},5992,-499,11141,null,572627.8607883848,585151.27157607861,null,null,null,null,null,null,null,null,null,null,null,null,null,null,53]
[54,"2015-11-01","2015-11-01",12000,0,0,360,11640,39,{"$f":"INDEX('PM 60-64'!$A$2:$E$107,I80+1,4)","v":3.5279337053033218E-3},5992,-499,11141,null,585151.27157607861,597704.33879003034,null,null,null,null,null,null,null,null,null,null,null,null,null,null,54]
[55,"2015-12-01","2015-12-01",12000,0,0,360,11640,40,{"$f":"INDEX('PM 60-64'!$A$2:$E$107,I81+1,4)","v":3.820531564211136E-3},6489,-541,11099,null,597704.33879003034,610245.03319968202,null,null,null,null,null,null,null,null,null,null,null,null,null,null,55]
[56,"2016-01-01","2016-01-01",12000,0,0,360,11640,40,{"$f":"INDEX('PM 60-64'!$A$2:$E$107,I82+1,4)","v":3.820531564211136E-3},6489,-541,11099,null,610245.03319968202,622815.42496457405,null,null,null,null,null,null,null,null,null,null,null,null,null,null,56]
[57,"2016-02-01","2016-02-01",12000,0,0,360,11640,40,{"$f":"INDEX('PM 60-64'!$A$2:$E$107,I83+1,4)","v":3.820531564211136E-3},6489,-541,11099,null,622815.42496457405,635415.58441039012,null,null,null,null,null,null,null,null,null,null,null,null,null,null,57]
[58,"2016-03-01","2016-03-01",12000,0,0,360,11640,40,{"$f":"INDEX('PM 60-64'!$A$2:$E$107,I84+1,4)","v":3.820531564211136E-3},6489,-541,11099,null,635415.58441039012,648045.58202935068,null,null,null,null,null,null,null,null,null,null,null,null,null,null,58]
[59,"2016-04-01","2016-04-01",12000,0,0,360,11640,40,{"$f":"INDEX('PM 60-64'!$A$2:$E$107,I85+1,4)","v":3.820531564211136E-3},6489,-541,11099,null,648045.58202935068,660705.48848060728,null,null,null,null,null,null,null,null,null,null,null,null,null,null,59]
[60,"2016-05-01","2016-05-01",12000,0,0,360,11640,40,{"$f":"INDEX('PM 60-64'!$A$2:$E$107,I86+1,4)","v":3.820531564211136E-3},6489,-541,11099,null,660705.48848060728,673395.37459063809,null,null,null,null,null,null,null,{"$f":"SUM(H75:H86)","v":139680},null,null,null,null,null,null,60]
[61,"2016-06-01","2016-06-01",12000,0,0,360,11640,40,{"$f":"INDEX('PM 60-64'!$A$2:$E$107,I87+1,4)","v":3.820531564211136E-3},6489,-541,11099,null,673395.37459063809,686115.31135364377]
[62,"2016-07-01","2016-07-01",12000,0,0,360,11640,40,{"$f":"INDEX('PM 60-64'!$A$2:$E$107,I88+1,4)","v":3.820531564211136E-3},6489,-541,11099,null,686115.31135364377,698865.369931945]
[63,"2016-08-01","2016-08-01",12000,0,0,360,11640,40,{"$f":"INDEX('PM 60-64'!$A$2:$E$107,I89+1,4)","v":3.820531564211136E-3},6489,-541,11099,null,698865.369931945,711645.62165638036]
[64,"2016-09-01","2016-09-01",12000,0,0,360,11640,40,{"$f":"INDEX('PM 60-64'!$A$2:$E$107,I90+1,4)","v":3.820531564211136E-3},6489,-541,11099,null,711645.62165638036,724456.13802670571]
[65,"2016-10-01","2016-10-01",{"$f":"$F$7","v":12000},0,0,360,{"$f":"ROUND(D91-E91-F91-G91,1)","v":11640},{"$f":"INT(YEAR(C91)-YEAR($P$4)+$N$2+(MONTH(C91)-MONTH($P$4))/12)","v":40},{"$f":"INDEX('PM 60-64'!$A$2:$E$107,I91+1,4)","v":3.820531564211136E-3},{"$f":"ROUND((J91*(1+$P$5)*(1+$C$6)^(-0.5)+$P$8)*(1+$L$7)*$P$7,0)","v":6489},{"$f":"ROUND(-K91*(1+$L$4)/12,0)","v":-541},{"$f":"H91+L91","v":11099},null,724456.13802670571,737296.99071199365]
[66,"2016-11-01",{"$f":"B92","v":"2016-11-01"},12000,{"$f":"IF($H$6=\"O\",IF(12*(YEAR(C92)-YEAR($I$1))+MONTH(C92)-MONTH($I$1)+1>12,0,D92*$H$4*MIN($H$5,$N$1)),D92*$H$4)","v":0},{"$f":"IF($L$8=\"Ppure\",IF((12*YEAR(C92)+MONTH(C92))-(12*YEAR($P$6)+MONTH($P$6))>1,0,ROUND((D92-E92)*$L$4/(1+$L$4+$L$5),0)),D92*$L$4)","v":0},{"$f":"IF($L$8=\"Ppure\",IF((12*YEAR(C92)+MONTH(C92))-(12*YEAR($P$6)+MONTH($P$6))>1,0,ROUND((D92-E92)*$L$5/(1+$L$4+$L$5),0)),D92*$L$5)","v":360},11640,40,{"$f":"INDEX('PM 60-64'!$A$2:$E$107,I92+1,4)","v":3.820531564211136E-3},6489,-541,11099,null,737296.99071199365,{"$f":"(O92+M92)*(1+$C$8)","v":750168.25155103509}]
[67,{"$f":"DATE(YEAR(B92),MONTH(B92)+1,DAY(B92))","v":"2016-12-01"},"2016-12-01",12000,0,0,360,11640,41,{"$f":"INDEX('PM 60-64'!$A$2:$E$107,I93+1,4)","v":4.1395038344709516E-3},7031,-586,11054,null,{"$f":"P92","v":750168.25155103509},763024.88598918507]
[68,"2017-01-01","2017-01-01",12000,0,0,360,11640,41,{"$f":"INDEX('PM 60-64'!$A$2:$E$107,I94+1,4)","v":4.1395038344709516E-3},7031,-586,11054,null,763024.88598918507,775911.9659535262]
[69,"2017-02-01","2017-02-01",12000,0,0,360,11640,41,{"$f":"INDEX('PM 60-64'!$A$2:$E$107,I95+1,4)","v":4.1395038344709516E-3},7031,-586,11054,null,775911.9659535262,788829.56354147021]
[70,"2017-03-01","2017-03-01",12000,0,0,360,11640,41,{"$f":"INDEX('PM 60-64'!$A$2:$E$107,I96+1,4)","v":4.1395038344709516E-3},7031,-586,11054,null,788829.56354147021,801777.75102116098]
[71,"2017-04-01","2017-04-01",12000,0,0,360,11640,41,{"$f":"INDEX('PM 60-64'!$A$2:$E$107,I97+1,4)","v":4.1395038344709516E-3},7031,-586,11054,null,801777.75102116098,814756.60083187919]
[72,"2017-05-01","2017-05-01",12000,0,0,360,11640,41,{"$f":"INDEX('PM 60-64'!$A$2:$E$107,I98+1,4)","v":4.1395038344709516E-3},7031,-586,11054,null,814756.60083187919,827766.18558444746]
[73,"2017-06-01","2017-06-01",12000,0,0,360,11640,41,{"$f":"INDEX('PM 60-64'!$A$2:$E$107,I99+1,4)","v":4.1395038344709516E-3},7031,-586,11054,null,827766.18558444746,840806.57806163654]
[74,"2017-07-01","2017-07-01",12000,0,0,360,11640,41,{"$f":"INDEX('PM 60-64'!$A$2:$E$107,I100+1,4)","v":4.1395038344709516E-3},7031,-586,11054,null,840806.57806163654,853877.85121857247]
[75,"2017-08-01","2017-08-01",12000,0,0,360,11640,41,{"$f":"INDEX('PM 60-64'!$A$2:$E$107,I101+1,4)","v":4.1395038344709516E-3},7031,-586,11054,null,853877.85121857247,866980.07818314491]
[76,"2017-09-01","2017-09-01",12000,0,0,360,11640,41,{"$f":"INDEX('PM 60-64'!$A$2:$E$107,I102+1,4)","v":4.1395038344709516E-3},7031,-586,11054,null,866980.07818314491,880113.33225641621]
[77,"2017-10-01","2017-10-01",12000,0,0,360,11640,41,{"$f":"INDEX('PM 60-64'!$A$2:$E$107,I103+1,4)","v":4.1395038344709516E-3},7031,-586,11054,null,880113.33225641621,893277.68691303115]
[78,"2017-11-01","2017-11-01",12000,0,0,360,11640,41,{"$f":"INDEX('PM 60-64'!$A$2:$E$107,I104+1,4)","v":4.1395038344709516E-3},7031,-586,11054,null,893277.68691303115,906473.21580162854]
[79,"2017-12-01","2017-12-01",12000,0,0,360,11640,42,{"$f":"INDEX('PM 60-64'!$A$2:$E$107,I105+1,4)","v":4.4877460698822969E-3},7623,-635,11005,null,906473.21580162854,919650.87670938123]
[80,"2018-01-01","2018-01-01",12000,0,0,360,11640,42,{"$f":"INDEX('PM 60-64'!$A$2:$E$107,I106+1,4)","v":4.4877460698822969E-3},7623,-635,11005,null,919650.87670938123,932859.74335937039]
[81,"2018-02-01","2018-02-01",12000,0,0,360,11640,42,{"$f":"INDEX('PM 60-64'!$A$2:$E$107,I107+1,4)","v":4.4877460698822969E-3},7623,-635,11005,null,932859.74335937039,946099.88964925928]
[82,"2018-03-01","2018-03-01",12000,0,0,360,11640,42,{"$f":"INDEX('PM 60-64'!$A$2:$E$107,I108+1,4)","v":4.4877460698822969E-3},7623,-635,11005,null,946099.88964925928,959371.38965170679]
[83,"2018-04-01","2018-04-01",12000,0,0,360,11640,42,{"$f":"INDEX('PM 60-64'!$A$2:$E$107,I109+1,4)","v":4.4877460698822969E-3},7623,-635,11005,null,959371.38965170679,972674.31761478155]
[84,"2018-05-01","2018-05-01",12000,0,0,360,11640,42,{"$f":"INDEX('PM 60-64'!$A$2:$E$107,I110+1,4)","v":4.4877460698822969E-3},7623,-635,11005,null,972674.31761478155,986008.7479623775]
[85,"2018-06-01","2018-06-01",12000,0,0,360,11640,42,{"$f":"INDEX('PM 60-64'!$A$2:$E$107,I111+1,4)","v":4.4877460698822969E-3},7623,-635,11005,null,986008.7479623775,999374.7552946303]
[86,"2018-07-01","2018-07-01",12000,0,0,360,11640,42,{"$f":"INDEX('PM 60-64'!$A$2:$E$107,I112+1,4)","v":4.4877460698822969E-3},7623,-635,11005,null,999374.7552946303,1012772.4143883346]
[87,"2018-08-01","2018-08-01",12000,0,0,360,11640,42,{"$f":"INDEX('PM 60-64'!$A$2:$E$107,I113+1,4)","v":4.4877460698822969E-3},7623,-635,11005,null,1012772.4143883346,1026201.8001973624]
[88,"2018-09-01","2018-09-01",12000,0,0,360,11640,42,{"$f":"INDEX('PM 60-64'!$A$2:$E$107,I114+1,4)","v":4.4877460698822969E-3},7623,-635,11005,null,1026201.8001973624,1039662.9878530826]
[89,"2018-10-01","2018-10-01",12000,0,0,360,11640,42,{"$f":"INDEX('PM 60-64'!$A$2:$E$107,I115+1,4)","v":4.4877460698822969E-3},7623,-635,11005,null,1039662.9878530826,1053156.0526647808]
[90,"2018-11-01","2018-11-01",12000,0,0,360,11640,42,{"$f":"INDEX('PM 60-64'!$A$2:$E$107,I116+1,4)","v":4.4877460698822969E-3},7623,-635,11005,null,1053156.0526647808,1066681.0701200808]
[91,"2018-12-01","2018-12-01",12000,0,0,360,11640,43,{"$f":"INDEX('PM 60-64'!$A$2:$E$107,I117+1,4)","v":4.8680914634538983E-3},8269,-689,10951,null,1066681.0701200808,1080183.988009101]
[92,"2019-01-01","2019-01-01",12000,0,0,360,11640,43,{"$f":"INDEX('PM 60-64'!$A$2:$E$107,I118+1,4)","v":4.8680914634538983E-3},8269,-689,10951,null,1080183.988009101,1093718.8818745888]
[93,"2019-02-01","2019-02-01",12000,0,0,360,11640,43,{"$f":"INDEX('PM 60-64'!$A$2:$E$107,I119+1,4)","v":4.8680914634538983E-3},8269,-689,10951,null,1093718.8818745888,1107285.8274381831]
[94,"2019-03-01","2019-03-01",12000,0,0,360,11640,43,{"$f":"INDEX('PM 60-64'!$A$2:$E$107,I120+1,4)","v":4.8680914634538983E-3},8269,-689,10951,null,1107285.8274381831,1120884.9006008375]
[95,"2019-04-01","2019-04-01",12000,0,0,360,11640,43,{"$f":"INDEX('PM 60-64'!$A$2:$E$107,I121+1,4)","v":4.8680914634538983E-3},8269,-689,10951,null,1120884.9006008375,1134516.1774432452]
[96,"2019-05-01","2019-05-01",12000,0,0,360,11640,43,{"$f":"INDEX('PM 60-64'!$A$2:$E$107,I122+1,4)","v":4.8680914634538983E-3},8269,-689,10951,null,1134516.1774432452,1148179.7342262641]
[97,"2019-06-01","2019-06-01",12000,0,0,360,11640,43,{"$f":"INDEX('PM 60-64'!$A$2:$E$107,I123+1,4)","v":4.8680914634538983E-3},8269,-689,10951,null,1148179.7342262641,1161875.6473913442]
[98,"2019-07-01","2019-07-01",12000,0,0,360,11640,43,{"$f":"INDEX('PM 60-64'!$A$2:$E$107,I124+1,4)","v":4.8680914634538983E-3},8269,-689,10951,null,1161875.6473913442,1175603.9935609547]
[99,"2019-08-01","2019-08-01",12000,0,0,360,11640,43,{"$f":"INDEX('PM 60-64'!$A$2:$E$107,I125+1,4)","v":4.8680914634538983E-3},8269,-689,10951,null,1175603.9935609547,1189364.8495390131]
[100,"2019-09-01","2019-09-01",12000,0,0,360,11640,43,{"$f":"INDEX('PM 60-64'!$A$2:$E$107,I126+1,4)","v":4.8680914634538983E-3},8269,-689,10951,null,1189364.8495390131,1203158.2923113145]
[101,"2019-10-01","2019-10-01",12000,0,0,360,11640,43,{"$f":"INDEX('PM 60-64'!$A$2:$E$107,I127+1,4)","v":4.8680914634538983E-3},8269,-689,10951,null,1203158.2923113145,1216984.3990459624]
[102,"2019-11-01","2019-11-01",12000,0,0,360,11640,43,{"$f":"INDEX('PM 60-64'!$A$2:$E$107,I128+1,4)","v":4.8680914634538983E-3},8269,-689,10951,null,1216984.3990459624,1230843.2470938007]
[103,"2019-12-01","2019-12-01",12000,0,0,360,11640,44,{"$f":"INDEX('PM 60-64'!$A$2:$E$107,I129+1,4)","v":5.2835957343130785E-3},8974,-748,10892,null,1230843.2470938007,1244675.7742721841]
[104,"2020-01-01","2020-01-01",12000,0,0,360,11640,44,{"$f":"INDEX('PM 60-64'!$A$2:$E$107,I130+1,4)","v":5.2835957343130785E-3},8974,-748,10892,null,1244675.7742721841,1258541.0579678759]
[105,"2020-02-01","2020-02-01",12000,0,0,360,11640,44,{"$f":"INDEX('PM 60-64'!$A$2:$E$107,I131+1,4)","v":5.2835957343130785E-3},8974,-748,10892,null,1258541.0579678759,1272439.175750897]
[106,"2020-03-01","2020-03-01",12000,0,0,360,11640,44,{"$f":"INDEX('PM 60-64'!$A$2:$E$107,I132+1,4)","v":5.2835957343130785E-3},8974,-748,10892,null,1272439.175750897,1286370.2053749608]
[107,"2020-04-01","2020-04-01",12000,0,0,360,11640,44,{"$f":"INDEX('PM 60-64'!$A$2:$E$107,I133+1,4)","v":5.2835957343130785E-3},8974,-748,10892,null,1286370.2053749608,1300334.2247779071]
[108,"2020-05-01","2020-05-01",12000,0,0,360,11640,44,{"$f":"INDEX('PM 60-64'!$A$2:$E$107,I134+1,4)","v":5.2835957343130785E-3},8974,-748,10892,null,1300334.2247779071,1314331.3120821391]
[109,"2020-06-01","2020-06-01",12000,0,0,360,11640,44,{"$f":"INDEX('PM 60-64'!$A$2:$E$107,I135+1,4)","v":5.2835957343130785E-3},8974,-748,10892,null,1314331.3120821391,1328361.5455950599]
[110,"2020-07-01","2020-07-01",12000,0,0,360,11640,44,{"$f":"INDEX('PM 60-64'!$A$2:$E$107,I136+1,4)","v":5.2835957343130785E-3},8974,-748,10892,null,1328361.5455950599,1342425.0038095105]
[111,"2020-08-01","2020-08-01",12000,0,0,360,11640,44,{"$f":"INDEX('PM 60-64'!$A$2:$E$107,I137+1,4)","v":5.2835957343130785E-3},8974,-748,10892,null,1342425.0038095105,1356521.7654042095]
[112,"2020-09-01","2020-09-01",12000,0,0,360,11640,44,{"$f":"INDEX('PM 60-64'!$A$2:$E$107,I138+1,4)","v":5.2835957343130785E-3},8974,-748,10892,null,1356521.7654042095,1370651.9092441925]
[113,"2020-10-01","2020-10-01",12000,0,0,360,11640,44,{"$f":"INDEX('PM 60-64'!$A$2:$E$107,I139+1,4)","v":5.2835957343130785E-3},8974,-748,10892,null,1370651.9092441925,1384815.5143812541]
[114,"2020-11-01","2020-11-01",12000,0,0,360,11640,44,{"$f":"INDEX('PM 60-64'!$A$2:$E$107,I140+1,4)","v":5.2835957343130785E-3},8974,-748,10892,null,1384815.5143812541,1399012.6600543896]
[115,"2020-12-01","2020-12-01",12000,0,0,360,11640,45,{"$f":"INDEX('PM 60-64'!$A$2:$E$107,I141+1,4)","v":5.7363240941862162E-3},9743,-812,10828,null,1399012.6600543896,1413179.2741331819]
[116,"2021-01-01","2021-01-01",12000,0,0,360,11640,45,{"$f":"INDEX('PM 60-64'!$A$2:$E$107,I142+1,4)","v":5.7363240941862162E-3},9743,-812,10828,null,1413179.2741331819,1427379.4358734598]
[117,"2021-02-01","2021-02-01",12000,0,0,360,11640,45,{"$f":"INDEX('PM 60-64'!$A$2:$E$107,I143+1,4)","v":5.7363240941862162E-3},9743,-812,10828,null,1427379.4358734598,1441613.2247187365]
[118,"2021-03-01","2021-03-01",12000,0,0,360,11640,45,{"$f":"INDEX('PM 60-64'!$A$2:$E$107,I144+1,4)","v":5.7363240941862162E-3},9743,-812,10828,null,1441613.2247187365,1455880.7203006535]
[119,"2021-04-01","2021-04-01",12000,0,0,360,11640,45,{"$f":"INDEX('PM 60-64'!$A$2:$E$107,I145+1,4)","v":5.7363240941862162E-3},9743,-812,10828,null,1455880.7203006535,1470182.0024394265]
[120,"2021-05-01","2021-05-01",12000,0,0,360,11640,45,{"$f":"INDEX('PM 60-64'!$A$2:$E$107,I146+1,4)","v":5.7363240941862162E-3},9743,-812,10828,null,1470182.0024394265,1484517.151144292]
[121,"2021-06-01","2021-06-01",12000,0,0,360,11640,45,{"$f":"INDEX('PM 60-64'!$A$2:$E$107,I147+1,4)","v":5.7363240941862162E-3},9743,-812,10828,null,1484517.151144292,1498886.246613954]
[122,"2021-07-01","2021-07-01",12000,0,0,360,11640,45,{"$f":"INDEX('PM 60-64'!$A$2:$E$107,I148+1,4)","v":5.7363240941862162E-3},9743,-812,10828,null,1498886.246613954,1513289.3692370339]
[123,"2021-08-01","2021-08-01",12000,0,0,360,11640,45,{"$f":"INDEX('PM 60-64'!$A$2:$E$107,I149+1,4)","v":5.7363240941862162E-3},9743,-812,10828,null,1513289.3692370339,1527726.5995925197]
[124,"2021-09-01","2021-09-01",12000,0,0,360,11640,45,{"$f":"INDEX('PM 60-64'!$A$2:$E$107,I150+1,4)","v":5.7363240941862162E-3},9743,-812,10828,null,1527726.5995925197,1542198.0184502166]
[125,"2021-10-01","2021-10-01",12000,0,0,360,11640,45,{"$f":"INDEX('PM 60-64'!$A$2:$E$107,I151+1,4)","v":5.7363240941862162E-3},9743,-812,10828,null,1542198.0184502166,1556703.7067711991]
[126,"2021-11-01","2021-11-01",12000,0,0,360,11640,45,{"$f":"INDEX('PM 60-64'!$A$2:$E$107,I152+1,4)","v":5.7363240941862162E-3},9743,-812,10828,null,1556703.7067711991,1571243.7457082642]
[127,"2021-12-01","2021-12-01",12000,0,0,360,11640,46,{"$f":"INDEX('PM 60-64'!$A$2:$E$107,I153+1,4)","v":6.2295863968486135E-3},10581,-882,10758,null,1571243.7457082642,1585748.0508408539]
[128,"2022-01-01","2022-01-01",12000,0,0,360,11640,46,{"$f":"INDEX('PM 60-64'!$A$2:$E$107,I154+1,4)","v":6.2295863968486135E-3},10581,-882,10758,null,1585748.0508408539,1600286.7033140268]
[129,"2022-02-01","2022-02-01",{"$f":"$F$7","v":12000},0,0,360,{"$f":"ROUND(D155-E155-F155-G155,1)","v":11640},{"$f":"INT(YEAR(C155)-YEAR($P$4)+$N$2+(MONTH(C155)-MONTH($P$4))/12)","v":46},{"$f":"INDEX('PM 60-64'!$A$2:$E$107,I155+1,4)","v":6.2295863968486135E-3},{"$f":"ROUND((J155*(1+$P$5)*(1+$C$6)^(-0.5)+$P$8)*(1+$L$7)*$P$7,0)","v":10581},{"$f":"ROUND(-K155*(1+$L$4)/12,0)","v":-882},{"$f":"H155+L155","v":10758},null,1600286.7033140268,1614859.7844649991]
[130,"2022-03-01",{"$f":"B156","v":"2022-03-01"},12000,{"$f":"IF($H$6=\"O\",IF(12*(YEAR(C156)-YEAR($I$1))+MONTH(C156)-MONTH($I$1)+1>12,0,D156*$H$4*MIN($H$5,$N$1)),D156*$H$4)","v":0},{"$f":"IF($L$8=\"Ppure\",IF((12*YEAR(C156)+MONTH(C156))-(12*YEAR($P$6)+MONTH($P$6))>1,0,ROUND((D156-E156)*$L$4/(1+$L$4+$L$5),0)),D156*$L$4)","v":0},{"$f":"IF($L$8=\"Ppure\",IF((12*YEAR(C156)+MONTH(C156))-(12*YEAR($P$6)+MONTH($P$6))>1,0,ROUND((D156-E156)*$L$5/(1+$L$4+$L$5),0)),D156*$L$5)","v":360},11640,46,{"$f":"INDEX('PM 60-64'!$A$2:$E$107,I156+1,4)","v":6.2295863968486135E-3},10581,-882,10758,null,1614859.7844649991,{"$f":"(O156+M156)*(1+$C$8)","v":1629467.3758236002}]
[131,{"$f":"DATE(YEAR(B156),MONTH(B156)+1,DAY(B156))","v":"2022-04-01"},"2022-04-01",12000,0,0,360,11640,46,{"$f":"INDEX('PM 60-64'!$A$2:$E$107,I157+1,4)","v":6.2295863968486135E-3},10581,-882,10758,null,{"$f":"P156","v":1629467.3758236002},1644109.5591127286]
[132,"2022-05-01","2022-05-01",12000,0,0,360,11640,46,{"$f":"INDEX('PM 60-64'!$A$2:$E$107,I158+1,4)","v":6.2295863968486135E-3},10581,-882,10758,null,1644109.5591127286,1658786.4162488088]
[133,"2022-06-01","2022-06-01",12000,0,0,360,11640,46,{"$f":"INDEX('PM 60-64'!$A$2:$E$107,I159+1,4)","v":6.2295863968486135E-3},10581,-882,10758,null,1658786.4162488088,1673498.0293422502]
[134,"2022-07-01","2022-07-01",12000,0,0,360,11640,46,{"$f":"INDEX('PM 60-64'!$A$2:$E$107,I160+1,4)","v":6.2295863968486135E-3},10581,-882,10758,null,1673498.0293422502,1688244.4806979061]
[135,"2022-08-01","2022-08-01",12000,0,0,360,11640,46,{"$f":"INDEX('PM 60-64'!$A$2:$E$107,I161+1,4)","v":6.2295863968486135E-3},10581,-882,10758,null,1688244.4806979061,1703025.852815534]
[136,"2022-09-01","2022-09-01",12000,0,0,360,11640,46,{"$f":"INDEX('PM 60-64'!$A$2:$E$107,I162+1,4)","v":6.2295863968486135E-3},10581,-882,10758,null,1703025.852815534,1717842.2283902573]
[137,"2022-10-01","2022-10-01",12000,0,0,360,11640,46,{"$f":"INDEX('PM 60-64'!$A$2:$E$107,I163+1,4)","v":6.2295863968486135E-3},10581,-882,10758,null,1717842.2283902573,1732693.6903130284]
[138,"2022-11-01","2022-11-01",12000,0,0,360,11640,46,{"$f":"INDEX('PM 60-64'!$A$2:$E$107,I164+1,4)","v":6.2295863968486135E-3},10581,-882,10758,null,1732693.6903130284,1747580.3216710917]
[139,"2022-12-01","2022-12-01",12000,0,0,360,11640,47,{"$f":"INDEX('PM 60-64'!$A$2:$E$107,I165+1,4)","v":6.7710917536601906E-3},11501,-958,10682,null,1747580.3216710917,1762426.0257744438]
[140,"2023-01-01","2023-01-01",12000,0,0,360,11640,47,{"$f":"INDEX('PM 60-64'!$A$2:$E$107,I166+1,4)","v":6.7710917536601906E-3},11501,-958,10682,null,1762426.0257744438,1777306.8856781165]
[141,"2023-02-01","2023-02-01",12000,0,0,360,11640,47,{"$f":"INDEX('PM 60-64'!$A$2:$E$107,I167+1,4)","v":6.7710917536601906E-3},11501,-958,10682,null,1777306.8856781165,1792222.9846338229]
[142,"2023-03-01","2023-03-01",12000,0,0,360,11640,47,{"$f":"INDEX('PM 60-64'!$A$2:$E$107,I168+1,4)","v":6.7710917536601906E-3},11501,-958,10682,null,1792222.9846338229,1807174.4060904228]
[143,"2023-04-01","2023-04-01",12000,0,0,360,11640,47,{"$f":"INDEX('PM 60-64'!$A$2:$E$107,I169+1,4)","v":6.7710917536601906E-3},11501,-958,10682,null,1807174.4060904228,1822161.233694389]
[144,"2023-05-01","2023-05-01",12000,0,0,360,11640,47,{"$f":"INDEX('PM 60-64'!$A$2:$E$107,I170+1,4)","v":6.7710917536601906E-3},11501,-958,10682,null,1822161.233694389,1837183.551290276]
[145,"2023-06-01","2023-06-01",12000,0,0,360,11640,47,{"$f":"INDEX('PM 60-64'!$A$2:$E$107,I171+1,4)","v":6.7710917536601906E-3},11501,-958,10682,null,1837183.551290276,1852241.4429211889]
[146,"2023-07-01","2023-07-01",12000,0,0,360,11640,47,{"$f":"INDEX('PM 60-64'!$A$2:$E$107,I172+1,4)","v":6.7710917536601906E-3},11501,-958,10682,null,1852241.4429211889,1867334.9928292534]
[147,"2023-08-01","2023-08-01",12000,0,0,360,11640,47,{"$f":"INDEX('PM 60-64'!$A$2:$E$107,I173+1,4)","v":6.7710917536601906E-3},11501,-958,10682,null,1867334.9928292534,1882464.2854560874]
[148,"2023-09-01","2023-09-01",12000,0,0,360,11640,47,{"$f":"INDEX('PM 60-64'!$A$2:$E$107,I174+1,4)","v":6.7710917536601906E-3},11501,-958,10682,null,1882464.2854560874,1897629.405443273]
[149,"2023-10-01","2023-10-01",12000,0,0,360,11640,47,{"$f":"INDEX('PM 60-64'!$A$2:$E$107,I175+1,4)","v":6.7710917536601906E-3},11501,-958,10682,null,1897629.405443273,1912830.4376328303]
[150,"2023-11-01","2023-11-01",12000,0,0,360,11640,47,{"$f":"INDEX('PM 60-64'!$A$2:$E$107,I176+1,4)","v":6.7710917536601906E-3},11501,-958,10682,null,1912830.4376328303,1928067.4670676922]
[151,"2023-12-01","2023-12-01",12000,0,0,360,11640,48,{"$f":"INDEX('PM 60-64'!$A$2:$E$107,I177+1,4)","v":7.3577054802068135E-3},12497,-1041,10599,null,1928067.4670676922,1943257.3824416215]
[152,"2024-01-01","2024-01-01",12000,0,0,360,11640,48,{"$f":"INDEX('PM 60-64'!$A$2:$E$107,I178+1,4)","v":7.3577054802068135E-3},12497,-1041,10599,null,1943257.3824416215,1958483.2687353576]
[153,"2024-02-01","2024-02-01",12000,0,0,360,11640,48,{"$f":"INDEX('PM 60-64'!$A$2:$E$107,I179+1,4)","v":7.3577054802068135E-3},12497,-1041,10599,null,1958483.2687353576,1973745.2111308808]
[154,"2024-03-01","2024-03-01",12000,0,0,360,11640,48,{"$f":"INDEX('PM 60-64'!$A$2:$E$107,I180+1,4)","v":7.3577054802068135E-3},12497,-1041,10599,null,1973745.2111308808,1989043.2950118887]
[155,"2024-04-01","2024-04-01",12000,0,0,360,11640,48,{"$f":"INDEX('PM 60-64'!$A$2:$E$107,I181+1,4)","v":7.3577054802068135E-3},12497,-1041,10599,null,1989043.2950118887,2004377.6059642748]
[156,"2024-05-01","2024-05-01",12000,0,0,360,11640,48,{"$f":"INDEX('PM 60-64'!$A$2:$E$107,I182+1,4)","v":7.3577054802068135E-3},12497,-1041,10599,null,2004377.6059642748,2019748.2297766067]
[157,"2024-06-01","2024-06-01",12000,0,0,360,11640,48,{"$f":"INDEX('PM 60-64'!$A$2:$E$107,I183+1,4)","v":7.3577054802068135E-3},12497,-1041,10599,null,2019748.2297766067,2035155.2524406058]
[158,"2024-07-01","2024-07-01",12000,0,0,360,11640,48,{"$f":"INDEX('PM 60-64'!$A$2:$E$107,I184+1,4)","v":7.3577054802068135E-3},12497,-1041,10599,null,2035155.2524406058,2050598.7601516286]
[159,"2024-08-01","2024-08-01",12000,0,0,360,11640,48,{"$f":"INDEX('PM 60-64'!$A$2:$E$107,I185+1,4)","v":7.3577054802068135E-3},12497,-1041,10599,null,2050598.7601516286,2066078.8393091497]
[160,"2024-09-01","2024-09-01",12000,0,0,360,11640,48,{"$f":"INDEX('PM 60-64'!$A$2:$E$107,I186+1,4)","v":7.3577054802068135E-3},12497,-1041,10599,null,2066078.8393091497,2081595.5765172436]
[161,"2024-10-01","2024-10-01",12000,0,0,360,11640,48,{"$f":"INDEX('PM 60-64'!$A$2:$E$107,I187+1,4)","v":7.3577054802068135E-3},12497,-1041,10599,null,2081595.5765172436,2097149.0585850708]
[162,"2024-11-01","2024-11-01",12000,0,0,360,11640,48,{"$f":"INDEX('PM 60-64'!$A$2:$E$107,I188+1,4)","v":7.3577054802068135E-3},12497,-1041,10599,null,2097149.0585850708,2112739.3725273623]
[163,"2024-12-01","2024-12-01",12000,0,0,360,11640,49,{"$f":"INDEX('PM 60-64'!$A$2:$E$107,I189+1,4)","v":7.9962824495463415E-3},13582,-1132,10508,null,2112739.3725273623,2128275.3900697171]
[164,"2025-01-01","2025-01-01",12000,0,0,360,11640,49,{"$f":"INDEX('PM 60-64'!$A$2:$E$107,I190+1,4)","v":7.9962824495463415E-3},13582,-1132,10508,null,2128275.3900697171,2143848.1981291599]
[165,"2025-02-01","2025-02-01",12000,0,0,360,11640,49,{"$f":"INDEX('PM 60-64'!$A$2:$E$107,I191+1,4)","v":7.9962824495463415E-3},13582,-1132,10508,null,2143848.1981291599,2159457.8838285422]
[166,"2025-03-01","2025-03-01",12000,0,0,360,11640,49,{"$f":"INDEX('PM 60-64'!$A$2:$E$107,I192+1,4)","v":7.9962824495463415E-3},13582,-1132,10508,null,2159457.8838285422,2175104.5344970291]
[167,"2025-04-01","2025-04-01",12000,0,0,360,11640,49,{"$f":"INDEX('PM 60-64'!$A$2:$E$107,I193+1,4)","v":7.9962824495463415E-3},13582,-1132,10508,null,2175104.5344970291,2190788.2376705883]
[168,"2025-05-01","2025-05-01",12000,0,0,360,11640,49,{"$f":"INDEX('PM 60-64'!$A$2:$E$107,I194+1,4)","v":7.9962824495463415E-3},13582,-1132,10508,null,2190788.2376705883,2206509.0810924796]
[169,"2025-06-01","2025-06-01",12000,0,0,360,11640,49,{"$f":"INDEX('PM 60-64'!$A$2:$E$107,I195+1,4)","v":7.9962824495463415E-3},13582,-1132,10508,null,2206509.0810924796,2222267.1527137454]
[170,"2025-07-01","2025-07-01",12000,0,0,360,11640,49,{"$f":"INDEX('PM 60-64'!$A$2:$E$107,I196+1,4)","v":7.9962824495463415E-3},13582,-1132,10508,null,2222267.1527137454,2238062.5406937031]
[171,"2025-08-01","2025-08-01",12000,0,0,360,11640,49,{"$f":"INDEX('PM 60-64'!$A$2:$E$107,I197+1,4)","v":7.9962824495463415E-3},13582,-1132,10508,null,2238062.5406937031,2253895.333400439]
[172,"2025-09-01","2025-09-01",12000,0,0,360,11640,49,{"$f":"INDEX('PM 60-64'!$A$2:$E$107,I198+1,4)","v":7.9962824495463415E-3},13582,-1132,10508,null,2253895.333400439,2269765.6194113013]
[173,"2025-10-01","2025-10-01",12000,0,0,360,11640,49,{"$f":"INDEX('PM 60-64'!$A$2:$E$107,I199+1,4)","v":7.9962824495463415E-3},13582,-1132,10508,null,2269765.6194113013,2285673.4875133969]
[174,"2025-11-01","2025-11-01",12000,0,0,360,11640,49,{"$f":"INDEX('PM 60-64'!$A$2:$E$107,I200+1,4)","v":7.9962824495463415E-3},13582,-1132,10508,null,2285673.4875133969,2301619.0267040869]
[175,"2025-12-01","2025-12-01",12000,0,0,360,11640,50,{"$f":"INDEX('PM 60-64'!$A$2:$E$107,I201+1,4)","v":8.6906419551543677E-3},14761,-1230,10410,null,2301619.0267040869,2317504.0941197425]
[176,"2026-01-01","2026-01-01",12000,0,0,360,11640,50,{"$f":"INDEX('PM 60-64'!$A$2:$E$107,I202+1,4)","v":8.6906419551543677E-3},14761,-1230,10410,null,2317504.0941197425,2333426.7786301658]
[177,"2026-02-01","2026-02-01",12000,0,0,360,11640,50,{"$f":"INDEX('PM 60-64'!$A$2:$E$107,I203+1,4)","v":8.6906419551543677E-3},14761,-1230,10410,null,2333426.7786301658,2349387.1693156096]
[178,"2026-03-01","2026-03-01",12000,0,0,360,11640,50,{"$f":"INDEX('PM 60-64'!$A$2:$E$107,I204+1,4)","v":8.6906419551543677E-3},14761,-1230,10410,null,2349387.1693156096,2365385.3554672753]
[179,"2026-04-01","2026-04-01",12000,0,0,360,11640,50,{"$f":"INDEX('PM 60-64'!$A$2:$E$107,I205+1,4)","v":8.6906419551543677E-3},14761,-1230,10410,null,2365385.3554672753,2381421.4265878131]
[180,"2026-05-01","2026-05-01",12000,0,0,360,11640,50,{"$f":"INDEX('PM 60-64'!$A$2:$E$107,I206+1,4)","v":8.6906419551543677E-3},14761,-1230,10410,null,2381421.4265878131,2397495.4723918228]
[null,null,null,{"$f":"SUM(D27:D206)","v":2160000}]

{"sheet":"PM 60-64","index":1,"n_rows":108,"n_cols":17,"rows_kept":108,"cut":false,"hidden":true,"merged":[]}
["X","lx","dx","qx","px","Cx","Mx","Dx","Nx"]
[0,1000000,24280,{"$f":"C2/B2","v":2.4279999999999999E-2},{"$f":"B3/B2","v":0.99463199999999996},{"$f":"C2*1.035^(-0.5-A2)","v":23865.937969606017},{"$f":"SUM(F2:$F$107)","v":133120.90859547124},{"$f":"B2/(1.035^A2)","v":1000000},{"$f":"SUM(H2:H$107)","v":26565816.048511177}]
[1,994632,2220,2.2319812754868131E-3,0.9992700817990976,{"$f":"C3*1.035^(-0.5-A3)","v":2108.3487450168868},{"$f":"SUM(F3:$F$107)","v":109254.97062586524},{"$f":"B3/(1.035^A3)","v":960997.10144927539},{"$f":"SUM(H3:H$107)","v":25565816.048511177}]
[2,993906,1100,1.1067445009890272E-3,0.99944159709268277,{"$f":"C4*1.035^(-0.5-A4)","v":1009.3500541927039},{"$f":"SUM(F4:$F$107)","v":107146.62188084837},927821.88615837018,{"$f":"SUM(H4:H$107)","v":24604818.9470619}]
[3,993351,750,7.5502012883663474E-4,0.99952383397208033,664.92098431666932,{"$f":"SUM(F5:$F$107)","v":106137.27182665566},895945.68861803575,{"$f":"SUM(H5:H$107)","v":23676997.060903523}]
[4,992878,610,6.1437558290142397E-4,0.9995931020729637,522.5143966932925,{"$f":"SUM(F6:$F$107)","v":105472.35084233899},865235.81615290313,{"$f":"SUM(H6:H$107)","v":22781051.372285485}]
[5,992474,530,5.3401902719869745E-4,0.99962820184710133,438.63566998882555,{"$f":"SUM(F7:$F$107)","v":104949.83644564569},835636.4768047469,{"$f":"SUM(H7:H$107)","v":21915815.556132585}]
[6,992105,470,4.7374017871092274E-4,0.9996653580014212,375.82492916734674,{"$f":"SUM(F8:$F$107)","v":104511.20077565686},807078.05672094307,{"$f":"SUM(H8:H$107)","v":21080179.07932784}]
[7,991773,440,4.4364990779139984E-4,0.99968440358832111,339.93826463898154,{"$f":"SUM(F9:$F$107)","v":104135.37584648951},779524.61305027339,{"$f":"SUM(H9:H$107)","v":20273101.022606902}]
[8,991460,410,4.1353155951828616E-4,0.99968430395578234,306.04894269210024,{"$f":"SUM(F10:$F$107)","v":103795.43758185052},752926.18152616383,{"$f":"SUM(H10:H$107)","v":19493576.409556627}]
[9,991147,390,3.934835095096893E-4,0.99970337396975428,281.27509756078496,{"$f":"SUM(F11:$F$107)","v":103489.38863915842},727235.25189281953,{"$f":"SUM(H11:H$107)","v":18740650.228030466}]
[10,990853,380,3.8350794719297412E-4,0.99968511979072572,264.79508750922406,{"$f":"SUM(F12:$F$107)","v":103208.11354159765},702434.3333207689,{"$f":"SUM(H12:H$107)","v":18013414.976137642}]
[11,990541,379,3.8261919496517557E-4,0.99968401106062243,255.16739935417218,{"$f":"SUM(F13:$F$107)","v":102943.31845408841},678466.81222308346,{"$f":"SUM(H13:H$107)","v":17310980.642816871}]
[12,990228,390,3.9384868939274593E-4,0.99962836841616276,253.69402253101137,{"$f":"SUM(F14:$F$107)","v":102688.15105473425},655316.35189824761,{"$f":"SUM(H14:H$107)","v":16632513.830593791}]
[13,989860,430,4.3440486533449172E-4,0.99955751318368258,270.25499736983744,{"$f":"SUM(F15:$F$107)","v":102434.45703220324},632920.594825582,{"$f":"SUM(H15:H$107)","v":15977197.478695545}]
[14,989422,510,5.1545245608041867E-4,0.99945624819338963,{"$f":"C16*1.035^(-0.5-A16)","v":309.69564915990816},{"$f":"SUM(F16:$F$107)","v":102164.20203483339},611246.89449912636,{"$f":"SUM(H16:H$107)","v":15344276.883869965}]
[15,988884,649,6.5629537943783097E-4,0.99928404140424965,380.77574368623738,{"$f":"SUM(F17:$F$107)","v":101854.50638567348},590255.58250817156,{"$f":"SUM(H17:H$107)","v":14733029.989370842}]
[16,988176,800,8.0957238386684157E-4,0.9990922669645893,453.4967879963823,{"$f":"SUM(F18:$F$107)","v":101473.73064198725},569886.94101467181,{"$f":"SUM(H18:H$107)","v":14142774.406862665}]
[17,987279,970,9.8249836165865989E-4,0.99887265909636491,531.27039173489231,{"$f":"SUM(F19:$F$107)","v":101020.23385399087},550115.5901563901,{"$f":"SUM(H19:H$107)","v":13572887.465847995}]
[18,986166,1110,1.1255711513071835E-3,0.99866351101133077,587.38994454477859,{"$f":"SUM(F20:$F$107)","v":100488.96346225597},530913.45154577726,{"$f":"SUM(H20:H$107)","v":13022771.875691604}]
[19,984848,1221,1.2397852257404187E-3,0.99851144542101933,624.27916811522368,{"$f":"SUM(F21:$F$107)","v":99901.573517711193},512274.29136603861,{"$f":"SUM(H21:H$107)","v":12491858.424145825}]
[20,983382,1299,1.3209515732441716E-3,0.99842177302411472,641.69991286280401,{"$f":"SUM(F22:$F$107)","v":99277.294349595977},494214.24456418515,{"$f":"SUM(H22:H$107)","v":11979584.132779788}]
[21,981830,1370,1.3953535744477149E-3,0.99836733446727033,653.88751705848915,{"$f":"SUM(F23:$F$107)","v":98635.594436733169},476748.07952806499,{"$f":"SUM(H23:H$107)","v":11485369.888215601}]
[22,980227,1420,1.4486440385747383E-3,0.99833609969935533,654.83287437713227,{"$f":"SUM(F24:$F$107)","v":97981.706919674674},459874.11533412989,{"$f":"SUM(H24:H$107)","v":11008621.808687536}]
[23,978596,1470,1.5021520627511251E-3,0.99831084533351866,654.96654101815636,{"$f":"SUM(F25:$F$107)","v":97326.874045297533},443583.50787958142,{"$f":"SUM(H25:H$107)","v":10548747.693353407}]
[24,976943,1490,1.5251657466198131E-3,0.99827932642948458,641.42768156498937,{"$f":"SUM(F26:$F$107)","v":96671.907504279385},427859.15625823435,{"$f":"SUM(H26:H$107)","v":10105164.185473826}]
[25,975262,1530,1.5688092020400672E-3,0.99824662500948458,636.37412235802856,{"$f":"SUM(F27:$F$107)","v":96030.479822714391},412679.17904942785,{"$f":"SUM(H27:H$107)","v":9677305.029215591}]
[26,973552,1560,1.6023797393462291E-3,0.99820040429273427,626.91018968679532,{"$f":"SUM(F28:$F$107)","v":95394.105700356362},398024.73207514605,{"$f":"SUM(H28:H$107)","v":9264625.8501661643}]
[27,971800,1580,1.625848940111134E-3,0.99815188310351921,613.47584522800491,{"$f":"SUM(F29:$F$107)","v":94767.195510669568},383872.89707818168,{"$f":"SUM(H29:H$107)","v":8866601.1180910151}]
[28,970004,1606,1.6556632756153584E-3,0.99810516245293834,602.48407474847181,{"$f":"SUM(F30:$F$107)","v":94153.71966544156},370206.23680288933,{"$f":"SUM(H30:H$107)","v":8482728.2210128345}]
[29,968166,1646,1.7001216733494051E-3,0.99805301983337569,596.6086036276912,{"$f":"SUM(F31:$F$107)","v":93551.23559069309},357009.42620796029,{"$f":"SUM(H31:H$107)","v":8112521.9842099445}]
[30,966281,1729,1.7893345724483872E-3,0.99800575608958475,605.50024692991838,{"$f":"SUM(F32:$F$107)","v":92954.626987065407},344265.05887520331,{"$f":"SUM(H32:H$107)","v":7755512.5580019839}]
[31,964354,1853,1.9214935594190515E-3,0.99796340348046464,626.98102981038937,{"$f":"SUM(F33:$F$107)","v":92349.126740135485},331959.91340866929,{"$f":"SUM(H33:H$107)","v":7411247.4991267808}]
[32,962390,1989,2.0667297041739837E-3,0.9978927461839795,650.23960012246198,{"$f":"SUM(F34:$F$107)","v":91722.145710325101},320081.00966608309,{"$f":"SUM(H34:H$107)","v":7079287.5857181111}]
[33,960362,2136,2.2241613058409226E-3,0.99779458162651169,674.68263170217801,{"$f":"SUM(F35:$F$107)","v":91071.906110202632},308605.3311468875,{"$f":"SUM(H35:H$107)","v":6759206.5760520268}]
[34,958244,2297,2.3970930159750545E-3,0.99765821648765862,701.00146783002356,{"$f":"SUM(F36:$F$107)","v":90397.223478500455},297511.81379654084,{"$f":"SUM(H36:H$107)","v":6450601.2449051393}]
[35,956000,2471,2.5847280334728032E-3,0.99752301255230125,728.60194751313441,{"$f":"SUM(F37:$F$107)","v":89696.222010670434},286777.87974518392,{"$f":"SUM(H37:H$107)","v":6153089.4311085995}]
[36,953632,2662,2.7914331733834433E-3,0.99736166571591556,758.37722773739199,{"$f":"SUM(F38:$F$107)","v":88967.620063157301},276393.75317563035,{"$f":"SUM(H38:H$107)","v":5866311.5513634151}]
[37,951116,2868,3.015405061002023E-3,0.99719172004256051,789.43436853291826,{"$f":"SUM(F39:$F$107)","v":88209.242835419907},266342.54498620325,{"$f":"SUM(H39:H$107)","v":5589917.7981877858}]
[38,948445,3093,3.2611274243630364E-3,0.99699613578014534,822.57679335944738,{"$f":"SUM(F40:$F$107)","v":87419.808466886985},256613.1213094735,{"$f":"SUM(H40:H$107)","v":5323575.2532015825}]
[39,945596,3336,3.5279337053033218E-3,0.99676711830422293,857.20012390363058,{"$f":"SUM(F41:$F$107)","v":86597.231673527553},247190.61868215149,{"$f":"SUM(H41:H$107)","v":5066962.1318921093},null,9021]
[40,942539,3601,3.820531564211136E-3,0.99650306247274645,894.00295594740828,{"$f":"SUM(F42:$F$107)","v":85740.03154962392},238059.40159965816,{"$f":"SUM(H42:H$107)","v":4819771.5132099604},null,{"$f":"K45^(1/12)","v":1.0028708987190766},{"$f":"K41*K42","v":9046.8983773447908}]
[41,939243,3888,4.1395038344709516E-3,0.99618416107439711,932.61359035359862,{"$f":"SUM(F43:$F$107)","v":84846.028593676514},229204.75627486847,{"$f":"SUM(H43:H$107)","v":4581712.1116103018},null,{"$f":"(B42-B43)/B42","v":3.4969375272535142E-3}]
[42,935659,4199,4.4877460698822969E-3,0.99585639640082546,973.15273699696843,{"$f":"SUM(F44:$F$107)","v":83913.415003322909},220608.83849656183,{"$f":"SUM(H44:H$107)","v":4352507.355335433},null,1200000]
[43,931782,4536,4.8680914634538983E-3,0.99549894717863197,1015.7055602192492,{"$f":"SUM(F45:$F$107)","v":82940.262266325954},212265.43277232634,{"$f":"SUM(H45:H$107)","v":4131898.5168388728},null,1.0349999999999999,null,null,null,null,null,0.125]
[44,927588,4901,5.2835957343130785E-3,0.99512391277161838,1060.3253309294917,{"$f":"SUM(F46:$F$107)","v":81924.556706106698},204164.26555291552,{"$f":"SUM(H46:H$107)","v":3919633.0840665461},null,{"$f":"K45^(-0.5)","v":0.98294637436598087},null,null,null,null,{"$f":"Q46*3","v":1.47},0.49]
[45,923065,5295,5.7363240941862162E-3,0.99472843190891214,1106.8277749235165,{"$f":"SUM(F47:$F$107)","v":80864.231375177216},196298.30220788511,{"$f":"SUM(H47:H$107)","v":3715468.8185136304},null,1.2,null,null,null,null,null,{"$f":"Q46/Q45","v":3.92}]
[46,918199,5720,6.2295863968486135E-3,0.99433673963922853,1155.2334711102924,{"$f":"SUM(F48:$F$107)","v":79757.403600253703},188660.3887358756,{"$f":"SUM(H48:H$107)","v":3519170.5163057456},null,1.04]
[47,912999,6182,6.7710917536601906E-3,0.9939594676445429,1206.3196037978159,{"$f":"SUM(F49:$F$107)","v":78602.1701291434},181248.26650695657,{"$f":"SUM(H49:H$107)","v":3330510.1275698696},null,{"$f":"K43*K44*K46*K47*K48","v":5147.7035707441546},{"$f":"K43*K44*K46*K47*K48","v":5147.7035707441546}]
[48,907484,6677,7.3577054802068135E-3,0.99359217352592444,1258.8512378243233,{"$f":"SUM(F50:$F$107)","v":77395.850525345595},174061.28549637759,{"$f":"SUM(H50:H$107)","v":3149261.8610629127}]
[49,901669,7210,7.9962824495463415E-3,0.99322589553372687,1313.3725949001328,{"$f":"SUM(F51:$F$107)","v":76136.999287521263},167097.51785803121,{"$f":"SUM(H51:H$107)","v":2975200.5755665349}]
[50,895561,7783,8.6906419551543677E-3,0.99285922455310138,1369.8069517119586,{"$f":"SUM(F52:$F$107)","v":74823.626692621139},160353.21914589949,{"$f":"SUM(H52:H$107)","v":2808103.0577085037}]
[51,889166,8398,9.444805581859856E-3,0.99246035048573611,1428.0646076115393,{"$f":"SUM(F53:$F$107)","v":73453.819740909181},153824.32156115104,{"$f":"SUM(H53:H$107)","v":2647749.838562604}]
[52,882462,9057,1.0263331452232504E-2,0.99203705088717697,1488.044789953176,{"$f":"SUM(F54:$F$107)","v":72025.755133297658},147501.97110126622,{"$f":"SUM(H54:H$107)","v":2493925.5170014529}]
[53,875435,9761,1.1149885485501493E-2,0.99159389332160586,1549.4786582170093,{"$f":"SUM(F55:$F$107)","v":70537.710343344472},141379.15015588963,{"$f":"SUM(H55:H$107)","v":2346423.5459001865},null,{"$f":"C55/B55","v":1.1149885485501493E-2}]
[54,868076,10512,1.2109538796142273E-2,0.99111713720918448,1612.2644889355302,{"$f":"SUM(F56:$F$107)","v":68988.231685127466},135449.95356287778,{"$f":"SUM(H56:H$107)","v":2205044.3957442967}]
[55,860365,11310,1.3145583560465616E-2,0.99062490919551582,1675.99682441239,{"$f":"SUM(F57:$F$107)","v":67375.967196191938},129707.02435783227,{"$f":"SUM(H57:H$107)","v":2069594.4421814184}]
[56,852299,12158,1.4264946925902765E-2,0.99011497138914861,1740.7338545433126,{"$f":"SUM(F58:$F$107)","v":65699.970371779549},124145.90263429777,{"$f":"SUM(H58:H$107)","v":1939887.4178235861}]
[57,843874,13054,1.5469134017637705E-2,0.98940481635884026,1805.815994177183,{"$f":"SUM(F59:$F$107)","v":63959.236517236219},118762.04525105099,{"$f":"SUM(H59:H$107)","v":1815741.5151892882}]
[58,834933,14000,1.6767812507111349E-2,0.98858471278533722,1871.1886425306227,{"$f":"SUM(F60:$F$107)","v":62153.420523059031},113530.18316136849,{"$f":"SUM(H60:H$107)","v":1696979.4699382372}]
[59,825402,14992,1.8163270745648788E-2,0.98754303963402079,1936.0151917749547,{"$f":"SUM(F61:$F$107)","v":60282.231880528416},108438.84397395961,{"$f":"SUM(H61:H$107)","v":1583449.2867768689}]
[60,815120,16029,1.9664589262930611E-2,0.98647315732652863,1999.9321705206225,{"$f":"SUM(F62:$F$107)","v":58346.216688753455},103466.69139366511,{"$f":"SUM(H62:H$107)","v":1475010.4428029093}]
[61,804094,17110,2.1278606730058925E-2,0.98518456797339615,2062.6165460132406,{"$f":"SUM(F63:$F$107)","v":56346.284518232831},98615.568828249685,{"$f":"SUM(H63:H$107)","v":1371543.7514092443}]
[62,792181,18227,2.3008630603359587E-2,0.98385343753510879,2122.967430645318,{"$f":"SUM(F64:$F$107)","v":54283.667972219599},93869.11746039601,{"$f":"SUM(H64:H$107)","v":1272928.1825809942}]
[63,779390,19377,2.4861750856439008E-2,0.98248245422702374,2180.5915630082322,{"$f":"SUM(F65:$F$107)","v":52160.700541574275},89230.390233620798,{"$f":"SUM(H65:H$107)","v":1179059.0651205983}]
[64,765737,20552,{"$f":"C66/B66","v":2.6839502335658325E-2},{"$f":"B67/B66","v":0.98087202263962692},2234.6089281577756,{"$f":"SUM(F66:$F$107)","v":49980.108978566052},84702.698346244273,{"$f":"SUM(H66:H$107)","v":1089828.6748869775}]
[65,751090,21741,2.8945931912287476E-2,0.97921554008174783,2283.9500654909157,{"$f":"SUM(F67:$F$107)","v":47745.500050408271},{"$f":"B67/(1.035^A67)","v":80272.953671415278},{"$f":"SUM(H67:H$107)","v":1005125.9765407335}]
[66,735479,22934,3.1182399497470356E-2,0.97745958756130358,{"$f":"C68*1.035^(-0.5-A68)","v":2327.8047333248742},{"$f":"SUM(F68:$F$107)","v":45461.549984917358},75946.399694021296,{"$f":"SUM(H68:H$107)","v":924853.02286931837}]
[67,718901,24119,3.3549821185392702E-2,0.97583672856206904,2365.297030169861,{"$f":"SUM(F69:$F$107)","v":43133.745251592482},71724.189876023156,{"$f":"SUM(H69:H$107)","v":848906.62317529705}]
[68,701530,25278,3.6032671446695079E-2,0.97408806465867459,2395.1281149098586,{"$f":"SUM(F70:$F$107)","v":40768.448221422615},67624.250055442622,{"$f":"SUM(H70:H$107)","v":777182.43329927383}]
[69,683352,26393,3.8622847375876561E-2,0.97221197859960895,2416.2087189225244,{"$f":"SUM(F71:$F$107)","v":38373.320106512758},63644.420155072839,{"$f":"SUM(H71:H$107)","v":709558.18324383127}]
[70,664363,27446,4.1311752761667944E-2,0.97017895337338167,2427.6406366549613,{"$f":"SUM(F72:$F$107)","v":35957.111387590237},59783.447000761538,{"$f":"SUM(H72:H$107)","v":645913.76308875857}]
[71,644551,28412,4.408029775766386E-2,0.96798701731903292,2428.1012682837127,{"$f":"SUM(F73:$F$107)","v":33529.470750935274},56039.267671740941,{"$f":"SUM(H73:H$107)","v":586130.31608799705}]
[72,623917,29269,4.6911688573960962E-2,0.96565729095376474,2416.7544373438168,{"$f":"SUM(F74:$F$107)","v":31101.369482651557},52410.901996436165,{"$f":"SUM(H74:H$107)","v":530091.04841625597}]
[73,602490,29989,4.9775100001659779E-2,0.96317449252269749,2392.4687534074237,{"$f":"SUM(F75:$F$107)","v":28684.615045307743},48899.487573257786,{"$f":"SUM(H75:H$107)","v":477680.14641981985}]
[74,580303,30547,5.2639741652205828E-2,0.96050166895570077,2354.5748742441174,{"$f":"SUM(F76:$F$107)","v":26292.146291900321},45506.028142987947,{"$f":"SUM(H76:H$107)","v":428780.65884656203}]
[75,557382,30914,5.5462860300476154E-2,0.95758384734347357,2302.2834587323227,{"$f":"SUM(F77:$F$107)","v":23937.5714176562},42230.546839502422,{"$f":"SUM(H77:H$107)","v":383274.63070357405}]
[76,533740,31067,5.8206242739910818E-2,0.95437666279461908,2235.4376349172849,{"$f":"SUM(F78:$F$107)","v":21635.287958923876},39071.777312067148,{"$f":"SUM(H78:H$107)","v":341044.08386407164}]
[77,509389,30980,6.0817960340721927E-2,0.95087840530517931,2153.794702698422,{"$f":"SUM(F79:$F$107)","v":19399.850324006591},36028.205256565379,{"$f":"SUM(H79:H$107)","v":301972.30655200448}]
[78,484367,30633,6.3243367116256888E-2,0.94699886656192511,2057.6526893698206,{"$f":"SUM(F80:$F$107)","v":17246.055621308169},33099.944309536775,{"$f":"SUM(H80:H$107)","v":265944.10129543912}]
[79,458695,30013,6.5431277864376108E-2,0.94256096098714837,1947.8324633977174,{"$f":"SUM(F81:$F$107)","v":15188.402931938354},30285.6132796079,{"$f":"SUM(H81:H$107)","v":232844.15698590226}]
[80,432348,29110,6.7330021186636696E-2,0.93743697206879639,1825.3411608434267,{"$f":"SUM(F82:$F$107)","v":13240.570468540636},27580.711842427409,{"$f":"SUM(H82:H$107)","v":202558.54370629435}]
[81,405299,27923,6.889481592602005E-2,0.93160111423911729,1691.7008526455879,{"$f":"SUM(F83:$F$107)","v":11415.229307697211},24980.849272528645,{"$f":"SUM(H83:H$107)","v":174977.83186386697}]
[82,377577,26464,7.0089014955889789E-2,0.92515433937978209,1549.0899270583072,{"$f":"SUM(F84:$F$107)","v":9723.5284550516208},22485.204847272587,{"$f":"SUM(H84:H$107)","v":149996.98259133831}]
[83,349317,24752,7.0858274862088011E-2,0.9182519029992815,1399.8809019032772,{"$f":"SUM(F85:$F$107)","v":8174.438527993314},20098.825928789902,{"$f":"SUM(H85:H$107)","v":127511.77774406574}]
[84,320761,22820,7.1143312310411808E-2,0.91101474306415053,1246.9702221469947,{"$f":"SUM(F86:$F$107)","v":6774.557626090038},17831.676480350368,{"$f":"SUM(H86:H$107)","v":107412.95181527582}]
[85,292218,20710,7.0871746435880068E-2,0.90333244358663733,1093.4028249084097,{"$f":"SUM(F87:$F$107)","v":5527.5874039430428},15695.575040724105,{"$f":"SUM(H87:H$107)","v":89581.275334925449}]
[86,263970,18473,6.9981437284539913E-2,0.89512065765049054,942.31731897041743,{"$f":"SUM(F88:$F$107)","v":4434.1845790346333},13698.861985540812,{"$f":"SUM(H88:H$107)","v":73885.70029420135}]
[87,236285,16171,6.843853820598006E-2,0.88640836278223334,796.99623579474655,{"$f":"SUM(F89:$F$107)","v":3491.8672600642144},11847.472801507825,{"$f":"SUM(H89:H$107)","v":60186.838308660554}]
[88,209445,13867,6.6208312444794581E-2,0.8772088137697247,660.33080640065987,{"$f":"SUM(F90:$F$107)","v":2694.8710242694679},10146.569052262408,{"$f":"SUM(H90:H$107)","v":48339.365507152732}]
[89,183727,11628,6.3289554610917287E-2,0.867640575418964,534.98760075979749,{"$f":"SUM(F91:$F$107)","v":2034.5402178688082},8599.6713064422293,{"$f":"SUM(H91:H$107)","v":38192.796454890326}]
[90,159409,9513,5.9676680739481458E-2,0.85774956244628597,422.87872900727325,{"$f":"SUM(F92:$F$107)","v":1499.5526171090107},7209.1050828362231,{"$f":"SUM(H92:H$107)","v":29593.125148448085}]
[91,136733,7576,5.5407253552544007E-2,0.83939502534135868,325.38532330882089,{"$f":"SUM(F93:$F$107)","v":1076.6738881017375},5974.4992564561026,{"$f":"SUM(H93:H$107)","v":22384.020065611865}]
[92,114773,5859,5.1048591567703208E-2,0.80881391965009197,243.13145112029122,{"$f":"SUM(F94:$F$107)","v":751.28856479291642},4845.3767678984532,{"$f":"SUM(H94:H$107)","v":16409.520809155762}]
[93,92830,4389,4.7279974146288914E-2,0.77323063664763547,175.97171847052394,{"$f":"SUM(F95:$F$107)","v":508.15711367262537},3786.4813292999443,{"$f":"SUM(H95:H$107)","v":11564.144041257305}]
[94,71779,3174,4.4219061285334149E-2,0.73220579835327881,122.9543411505142,{"$f":"SUM(F96:$F$107)","v":332.18539520210146},2828.8148491874213,{"$f":"SUM(H96:H$107)","v":7777.6627119573614}]
[95,52557,2209,4.2030557299693669E-2,0.68538919649142838,82.67844704452115,{"$f":"SUM(F97:$F$107)","v":209.23105405158722},2001.2315314424018,{"$f":"SUM(H97:H$107)","v":4948.8478627699396}]
[96,36022,1475,4.0947198933984789E-2,0.63264116373327406,53.339417092862824,{"$f":"SUM(F98:$F$107)","v":126.5526070070661},1325.239102732965,{"$f":"SUM(H98:H$107)","v":2947.6163313275392}]
[97,22789,941,4.1291851331782876E-2,0.57409276405283249,32.878009651606611,{"$f":"SUM(F99:$F$107)","v":73.213189914203269},810.04909002688214,{"$f":"SUM(H99:H$107)","v":1622.3772285945743}]
[98,13083,570,4.3567988993350147E-2,0.5104333868378812,19.242008451709577,{"$f":"SUM(F100:$F$107)","v":40.335180262596651},449.31721846571457,{"$f":"SUM(H100:H$107)","v":812.32813856769178}]
[99,6678,328,4.9116501946690629E-2,0.44249775381850853,10.698158779830052,{"$f":"SUM(F101:$F$107)","v":21.093171810887064},221.59083051790424,{"$f":"SUM(H101:H$107)","v":363.01092010197715}]
[100,2955,177,5.9898477157360408E-2,0.37225042301184436,5.5778664546657239,{"$f":"SUM(F102:$F$107)","v":10.395013031057015},94.737627798019759,{"$f":"SUM(H102:H$107)","v":141.420089584073}]
[101,1100,90,8.1818181818181818E-2,0.30181818181818182,2.7402930261192457,{"$f":"SUM(F103:$F$107)","v":4.8171465763912922},34.073547848262336,{"$f":"SUM(H103:H$107)","v":46.682461786053224}]
[102,332,43,0.12951807228915663,0.23493975903614459,1.2649769202697536,{"$f":"SUM(F104:$F$107)","v":2.0768535502720455},9.936247593871844,{"$f":"SUM(H104:H$107)","v":12.608913937790886}]
[103,78,19,0.24358974358974358,0.16666666666666666,0.54004182642681331,{"$f":"SUM(F105:$F$107)","v":0.81187663000229215},2.2554778893021479,{"$f":"SUM(H105:H$107)","v":2.672666343919043}]
[104,13,7,0.53846153846153844,0.15384615384615385,0.1922345682678715,{"$f":"SUM(F106:$F$107)","v":0.27183480357547873},0.36320094835783384,{"$f":"SUM(H106:H$107)","v":0.41718845461689502}]
[105,2,3,1.5,0,7.9600235307607264E-2,{"$f":"SUM(F107:$F$107)","v":7.9600235307607264E-2},5.3987506259061152E-2,{"$f":"SUM(H107:H$107)","v":5.3987506259061152E-2}]
[106,0,1,{"$error":"#DIV/0!"},{"$f":"#REF!/B108","v":{"$error":"#REF!"}}]

{"sheet":"rente","index":2,"n_rows":9,"n_cols":7,"rows_kept":9,"cut":false,"hidden":true,"merged":[[1,0,1,6],[4,0,4,2],[4,3,4,6],[5,4,5,6],[6,4,6,6]]}
["Prévi-Pension"]
["Paramètres techniques"]
["Taux d'intérêt Annuel",null,"Taux d'intérêt Mensuel Equiv","Taux Charg. d'acquisition","Taux Charg. gestion","Frais Gestion Rente"]
[3.5,null,{"$f":"(1+A4/100)^(1/12)-1","v":2.8708987190766422E-3},3,5,1.5]
["Input",null,null,"Output"]
[null,null,null,null,"Rente Mensuelle"]
[null,null,null,"Capital Terme","durée (mois)"]
["Prime Mensuelle","Prime mensuelle investie","Durée Cotisation(mois)",null,6,12,18]
[10000,{"$f":"A9*(1-$D$4/100-$E$4/100)","v":9200},180,{"$f":"Resultat!H10","v":{"$error":"#REF!"}},{"$f":"$D$9*$C$4/((1+$F$4/100)*(1-(1+$C$4)^(-E8)))","v":{"$error":"#REF!"}},{"$f":"$D$9*$C$4/((1+$F$4/100)*(1-(1+$C$4)^(-F8)))","v":{"$error":"#REF!"}},{"$f":"$D$9*$C$4/((1+$F$4/100)*(1-(1+$C$4)^(-G8)))","v":{"$error":"#REF!"}}]

{"sheet":"Resultat","index":3,"n_rows":585,"n_cols":19,"rows_kept":585,"cut":false,"hidden":true,"merged":[[0,0,1,16],[4,0,4,2],[4,5,4,8],[4,10,4,12],[5,0,5,1],[5,5,5,7],[5,10,5,11],[10,7,10,8],[6,0,6,1],[6,5,6,7],[6,10,6,11],[7,0,7,1],[7,5,7,7],[7,10,7,11],[8,5,8,7],[8,10,8,11],[9,0,9,1],[9,7,9,8],[9,10,9,11],[12,15,12,16],[11,23,11,25],[12,23,12,25],[49,0,49,1],[37,0,37,1],[39,0,39,1],[41,0,41,1],[23,0,23,16],[26,0,26,1],[35,0,35,16],[43,0,43,1],[45,0,45,1],[47,0,47,1],[1,19,1,25],[4,19,4,21],[4,22,4,25],[5,23,5,25],[6,23,6,25]]}
["DONNEES TECHNIQUES"]
[]
["Police","xxxxxxxxxx",null,"ID",null,"xxxxxx",null,null,"Date effet",{"$f":"IF(DAY(Q16)=1,Q16,DATE(YEAR(Q16),MONTH(Q16)+1,1))","v":{"$error":"#REF!"}},null,null,null,"Differe",{"$f":"((YEAR(Q17)-YEAR(Q16))*12+(MONTH(Q17)-MONTH(Q16)))/12","v":{"$error":"#REF!"}},"Nbre année de cotis pr cap dec",{"$f":"12*MIN(O3,$I$7)","v":{"$error":"#REF!"}}]
[null,null,null,null,null,null,null,null,null,null,null,null,null,"Vieillissement",0]
["Taux d'interet",null,null,null,null,"Frais d'acquisition",null,null,null,null,"Frais de Gestion",null,null,null,null,"Autres"]
["taux interet technique",null,3.5000000000000003E-2,null,null,"taux de frais d'acquisition",null,null,0.03,null,"taux frais fract. mens",null,0.04,null,null,"date de naissance",{"$f":"Q18","v":{"$error":"#REF!"}}]
["taux interet reel",null,{"$f":"C6-M8*(1+C6)","v":2.9048750000000005E-2},null,null,"duree maximale pr calcul",null,null,20,null,"taux frais gestion prime",null,0.05,null,null,"taux majoration qx",0,null,{"$f":"DAY(Q16)","v":{"$error":"#REF!"}}]
["taux interet oper deces",null,3.5000000000000003E-2,null,null,"Escompte?",null,null,"O",null,"taux frais gestion PM",null,5.7499999999999999E-3,null,null,"date de calcul PM",{"$f":"DATE(YEAR(J3),MONTH(J3)+O3*12,DAY(J3)-1)","v":{"$error":"#REF!"}}]
[null,null,{"$f":"C7/12","v":2.4207291666666669E-3},null,null,"Cotisation",null,null,{"$f":"Q19","v":{"$error":"#REF!"}},null,"taux frais gestion deces",null,0.2,null,null,"Capital deces",{"$f":"IF(Q15=1,I9*5*12,0)","v":{"$error":"#REF!"}}]
["mensuel composé",null,{"$f":"(1+C7)^(1/12)-1","v":2.3890853122763289E-3},null,null,null,"Capital au Terme",{"$f":"VLOOKUP($Q$11,$B$54:$R$800,14,FALSE)","v":{"$error":"#REF!"}},null,null,"Assiette gestion contrat",null,"Ppure",null,null,"Doublement deces accidentel",0]
[null,null,null,null,null,"Cumul Cotisation","Capital au Terme",{"$f":"VLOOKUP($Q$11,$B$54:$R$800,4,FALSE)","v":{"$error":"#REF!"}},null,null,null,null,null,null,null,"date echeance ",{"$f":"IF(DAY(Q17)=1,Q17,DATE(YEAR(Q17),MONTH(Q17)+1,1))","v":{"$error":"#REF!"}}]
[]
[null,null,null,null,null,null,null,null,null,null,null,null,null,null,null,"Donner ramemer  input "]
[]
[null,null,null,null,null,null,null,null,null,null,null,null,null,null,null,"Code décès ",{"$f":"'Module '!#REF!","v":{"$error":"#REF!"}},"jours"]
[null,null,null,null,null,null,null,null,null,null,null,null,null,null,null,"Date effet",{"$f":"'Module '!#REF!","v":{"$error":"#REF!"}},{"$f":"DAY(Q16)","v":{"$error":"#REF!"}}]
[null,null,null,null,null,null,null,null,null,null,null,null,null,null,null,"Date échéance",{"$f":"'Module '!#REF!","v":{"$error":"#REF!"}},{"$f":"DAY(Q17)","v":{"$error":"#REF!"}}]
[null,null,null,null,null,null,null,null,null,null,null,null,null,null,null,"Date de naissance",{"$f":"'Module '!#REF!","v":{"$error":"#REF!"}}]
[null,null,null,null,null,null,null,null,null,null,null,null,null,null,null,null,{"$f":"'Module '!#REF!","v":{"$error":"#REF!"}}]
[]
[]
[]
[]
["ENTRER INFORMATIONS PROSPECT"]
[]
[]
["Cotisation Mensuelle",null,12000]
[]
["Date éffet contrat",null,"2011-06-01"]
[]
["Durée du contrat",null,15]
[]
["Date Naissance",null,"1975-12-16"]
[]
[]
[{"$f":"CONCATENATE(\"SIMULATION DE LA POLICE  \",#REF!)","v":{"$error":"#REF!"}}]
[]
["Nom  et Prénons ",null,{"$f":"+#REF!","v":{"$error":"#REF!"}}]
[]
["Date effet"]
[]
["Date d'échéance"]
[]
["Durée ",null,{"$f":"Q11","v":{"$error":"#REF!"}}]
[]
["Capital Déces garantie",null,{"$f":"Q9","v":{"$error":"#REF!"}}]
[]
["Capital au Terme",null,{"$f":"H10","v":{"$error":"#REF!"}}]
[]
["Cumul Cotisations",null,{"$f":"H11","v":{"$error":"#REF!"}}]
[]
[]
["N°","Date réception","Date échéance","Cotis","Cumil Cotis Début. Périod","Cions","Fract.","Gestion","Cot a investir","Age","qx annuel","Prime dec comm annuelle","Prime dec com mens","Cot epargne","PM debut","PM Fin"]
[1,{"$f":"J3","v":{"$error":"#REF!"}},{"$f":"B54","v":{"$error":"#REF!"}},{"$f":"$I$9","v":{"$error":"#REF!"}},0,{"$f":"IF($I$8=\"O\",IF(12*(YEAR(C54)-YEAR($J$3))+MONTH(C54)-MONTH($J$3)+1>12,0,D54*$I$6*MIN($I$7,$O$3)),D54*$I$6)","v":{"$error":"#REF!"}},{"$f":"IF($M$10=\"Ppure\",ROUND((D54-F54)*$M$6/(1+$M$6+$M$7),0),ROUND(D54*$M$6,0))","v":{"$error":"#REF!"}},{"$f":"IF($M$10=\"Ppure\",ROUND((D54-F54)*$M$7/(1+$M$6+$M$7),0),ROUND(D54*$M$7,0))","v":{"$error":"#REF!"}},{"$f":"ROUND(D54-F54-G54-H54,1)","v":{"$error":"#REF!"}},{"$f":"INT(YEAR(C54)-YEAR($Q$6)+$O$4+0*(MONTH(C54)-MONTH($Q$6))/12)","v":{"$error":"#REF!"}},{"$f":"INDEX('PM 60-64'!$A$2:$E$107,J54+1,4)","v":{"$error":"#REF!"}},{"$f":"IF(A54>120,0,ROUND((K54*(1+$Q$7)*(1+$C$8)^(-0.5)+$Q$10)*(1+$M$9)*$Q$9,0))","v":{"$error":"#REF!"}},{"$f":"ROUND(-L54/12,0)","v":{"$error":"#REF!"}},{"$f":"I54+M54","v":{"$error":"#REF!"}},0,{"$f":"N54*(1+$C$10)","v":{"$error":"#REF!"}}]
[2,{"$f":"DATE(YEAR(B54),MONTH(B54)+1,DAY(B54))","v":{"$error":"#REF!"}},{"$f":"B55","v":{"$error":"#REF!"}},{"$error":"#REF!"},{"$f":"E54+D54","v":{"$error":"#REF!"}},{"$f":"IF($I$8=\"O\",IF(12*(YEAR(C55)-YEAR($J$3))+MONTH(C55)-MONTH($J$3)+1>12,0,D55*$I$6*MIN($I$7,$O$3)),D55*$I$6)","v":{"$error":"#REF!"}},{"$f":"IF($M$10=\"Ppure\",ROUND((D55-F55)*$M$6/(1+$M$6+$M$7),0),ROUND(D55*$M$6,0))","v":{"$error":"#REF!"}},{"$f":"IF($M$10=\"Ppure\",ROUND((D55-F55)*$M$7/(1+$M$6+$M$7),0),ROUND(D55*$M$7,0))","v":{"$error":"#REF!"}},{"$error":"#REF!"},{"$f":"INT(YEAR(C55)-YEAR($Q$6)+$O$4+0*(MONTH(C55)-MONTH($Q$6))/12)","v":{"$error":"#REF!"}},{"$f":"INDEX('PM 60-64'!$A$2:$E$107,J55+1,4)","v":{"$error":"#REF!"}},{"$f":"IF(A55>120,0,ROUND((K55*(1+$Q$7)*(1+$C$8)^(-0.5)+$Q$10)*(1+$M$9)*$Q$9,0))","v":{"$error":"#REF!"}},{"$f":"ROUND(-L55/12,0)","v":{"$error":"#REF!"}},{"$error":"#REF!"},{"$f":"P54","v":{"$error":"#REF!"}},{"$f":"(O55+N55)*(1+$C$10)","v":{"$error":"#REF!"}}]
[3,{"$f":"DATE(YEAR(B55),MONTH(B55)+1,DAY(B55))","v":{"$error":"#REF!"}},{"$error":"#REF!"},{"$error":"#REF!"},{"$f":"E55+D55","v":{"$error":"#REF!"}},{"$error":"#REF!"},{"$error":"#REF!"},{"$error":"#REF!"},{"$error":"#REF!"},{"$error":"#REF!"},{"$f":"INDEX('PM 60-64'!$A$2:$E$107,J56+1,4)","v":{"$error":"#REF!"}},{"$error":"#REF!"},{"$error":"#REF!"},{"$error":"#REF!"},{"$f":"P55","v":{"$error":"#REF!"}},{"$error":"#REF!"}]
[4,{"$error":"#REF!"},{"$error":"#REF!"},{"$error":"#REF!"},{"$error":"#REF!"},{"$error":"#REF!"},{"$error":"#REF!"},{"$error":"#REF!"},{"$error":"#REF!"},{"$error":"#REF!"},{"$f":"INDEX('PM 60-64'!$A$2:$E$107,J57+1,4)","v":{"$error":"#REF!"}},{"$error":"#REF!"},{"$error":"#REF!"},{"$error":"#REF!"},{"$error":"#REF!"},{"$error":"#REF!"}]
[5,{"$error":"#REF!"},{"$error":"#REF!"},{"$error":"#REF!"},{"$error":"#REF!"},{"$error":"#REF!"},{"$error":"#REF!"},{"$error":"#REF!"},{"$error":"#REF!"},{"$error":"#REF!"},{"$f":"INDEX('PM 60-64'!$A$2:$E$107,J58+1,4)","v":{"$error":"#REF!"}},{"$error":"#REF!"},{"$error":"#REF!"},{"$error":"#REF!"},{"$error":"#REF!"},{"$error":"#REF!"}]
[6,{"$error":"#REF!"},{"$error":"#REF!"},{"$error":"#REF!"},{"$error":"#REF!"},{"$error":"#REF!"},{"$error":"#REF!"},{"$error":"#REF!"},{"$error":"#REF!"},{"$error":"#REF!"},{"$f":"INDEX('PM 60-64'!$A$2:$E$107,J59+1,4)","v":{"$error":"#REF!"}},{"$error":"#REF!"},{"$error":"#REF!"},{"$error":"#REF!"},{"$error":"#REF!"},{"$error":"#REF!"}]
[7,{"$error":"#REF!"},{"$error":"#REF!"},{"$error":"#REF!"},{"$error":"#REF!"},{"$error":"#REF!"},{"$error":"#REF!"},{"$error":"#REF!"},{"$error":"#REF!"},{"$error":"#REF!"},{"$f":"INDEX('PM 60-64'!$A$2:$E$107,J60+1,4)","v":{"$error":"#REF!"}},{"$error":"#REF!"},{"$error":"#REF!"},{"$error":"#REF!"},{"$error":"#REF!"},{"$error":"#REF!"}]
[8,{"$error":"#REF!"},{"$error":"#REF!"},{"$error":"#REF!"},{"$error":"#REF!"},{"$error":"#REF!"},{"$error":"#REF!"},{"$error":"#REF!"},{"$error":"#REF!"},{"$error":"#REF!"},{"$f":"INDEX('PM 60-64'!$A$2:$E$107,J61+1,4)","v":{"$error":"#REF!"}},{"$error":"#REF!"},{"$error":"#REF!"},{"$error":"#REF!"},{"$error":"#REF!"},{"$error":"#REF!"}]
[9,{"$error":"#REF!"},{"$error":"#REF!"},{"$error":"#REF!"},{"$error":"#REF!"},{"$error":"#REF!"},{"$error":"#REF!"},{"$error":"#REF!"},{"$error":"#REF!"},{"$error":"#REF!"},{"$f":"INDEX('PM 60-64'!$A$2:$E$107,J62+1,4)","v":{"$error":"#REF!"}},{"$error":"#REF!"},{"$error":"#REF!"},{"$error":"#REF!"},{"$error":"#REF!"},{"$error":"#REF!"}]
[10,{"$error":"#REF!"},{"$error":"#REF!"},{"$error":"#REF!"},{"$error":"#REF!"},{"$error":"#REF!"},{"$error":"#REF!"},{"$error":"#REF!"},{"$error":"#REF!"},{"$error":"#REF!"},{"$f":"INDEX('PM 60-64'!$A$2:$E$107,J63+1,4)","v":{"$error":"#REF!"}},{"$error":"#REF!"},{"$error":"#REF!"},{"$error":"#REF!"},{"$error":"#REF!"},{"$error":"#REF!"}]
[11,{"$error":"#REF!"},{"$error":"#REF!"},{"$error":"#REF!"},{"$error":"#REF!"},{"$error":"#REF!"},{"$error":"#REF!"},{"$error":"#REF!"},{"$error":"#REF!"},{"$error":"#REF!"},{"$f":"INDEX('PM 60-64'!$A$2:$E$107,J64+1,4)","v":{"$error":"#REF!"}},{"$error":"#REF!"},{"$error":"#REF!"},{"$error":"#REF!"},{"$error":"#REF!"},{"$error":"#REF!"}]
[12,{"$error":"#REF!"},{"$error":"#REF!"},{"$error":"#REF!"},{"$error":"#REF!"},{"$error":"#REF!"},{"$error":"#REF!"},{"$error":"#REF!"},{"$error":"#REF!"},{"$error":"#REF!"},{"$f":"INDEX('PM 60-64'!$A$2:$E$107,J65+1,4)","v":{"$error":"#REF!"}},{"$error":"#REF!"},{"$error":"#REF!"},{"$error":"#REF!"},{"$error":"#REF!"},{"$error":"#REF!"}]
[13,{"$error":"#REF!"},{"$error":"#REF!"},{"$error":"#REF!"},{"$error":"#REF!"},{"$error":"#REF!"},{"$error":"#REF!"},{"$error":"#REF!"},{"$error":"#REF!"},{"$error":"#REF!"},{"$f":"INDEX('PM 60-64'!$A$2:$E$107,J66+1,4)","v":{"$error":"#REF!"}},{"$error":"#REF!"},{"$error":"#REF!"},{"$error":"#REF!"},{"$error":"#REF!"},{"$error":"#REF!"}]
[14,{"$error":"#REF!"},{"$error":"#REF!"},{"$error":"#REF!"},{"$error":"#REF!"},{"$error":"#REF!"},{"$error":"#REF!"},{"$error":"#REF!"},{"$error":"#REF!"},{"$error":"#REF!"},{"$f":"INDEX('PM 60-64'!$A$2:$E$107,J67+1,4)","v":{"$error":"#REF!"}},{"$error":"#REF!"},{"$error":"#REF!"},{"$error":"#REF!"},{"$error":"#REF!"},{"$error":"#REF!"}]
[15,{"$error":"#REF!"},{"$error":"#REF!"},{"$error":"#REF!"},{"$error":"#REF!"},{"$error":"#REF!"},{"$error":"#REF!"},{"$error":"#REF!"},{"$error":"#REF!"},{"$error":"#REF!"},{"$f":"INDEX('PM 60-64'!$A$2:$E$107,J68+1,4)","v":{"$error":"#REF!"}},{"$error":"#REF!"},{"$error":"#REF!"},{"$error":"#REF!"},{"$error":"#REF!"},{"$error":"#REF!"}]
[16,{"$error":"#REF!"},{"$error":"#REF!"},{"$error":"#REF!"},{"$error":"#REF!"},{"$error":"#REF!"},{"$error":"#REF!"},{"$error":"#REF!"},{"$error":"#REF!"},{"$error":"#REF!"},{"$f":"INDEX('PM 60-64'!$A$2:$E$107,J69+1,4)","v":{"$error":"#REF!"}},{"$error":"#REF!"},{"$error":"#REF!"},{"$error":"#REF!"},{"$error":"#REF!"},{"$error":"#REF!"}]
[17,{"$error":"#REF!"},{"$error":"#REF!"},{"$error":"#REF!"},{"$error":"#REF!"},{"$error":"#REF!"},{"$error":"#REF!"},{"$error":"#REF!"},{"$error":"#REF!"},{"$error":"#REF!"},{"$f":"INDEX('PM 60-64'!$A$2:$E$107,J70+1,4)","v":{"$error":"#REF!"}},{"$error":"#REF!"},{"$error":"#REF!"},{"$error":"#REF!"},{"$error":"#REF!"},{"$error":"#REF!"}]
[18,{"$error":"#REF!"},{"$error":"#REF!"},{"$error":"#REF!"},{"$error":"#REF!"},{"$error":"#REF!"},{"$error":"#REF!"},{"$error":"#REF!"},{"$error":"#REF!"},{"$error":"#REF!"},{"$f":"INDEX('PM 60-64'!$A$2:$E$107,J71+1,4)","v":{"$error":"#REF!"}},{"$error":"#REF!"},{"$error":"#REF!"},{"$error":"#REF!"},{"$error":"#REF!"},{"$error":"#REF!"}]
[19,{"$error":"#REF!"},{"$error":"#REF!"},{"$error":"#REF!"},{"$error":"#REF!"},{"$error":"#REF!"},{"$error":"#REF!"},{"$error":"#REF!"},{"$error":"#REF!"},{"$error":"#REF!"},{"$f":"INDEX('PM 60-64'!$A$2:$E$107,J72+1,4)","v":{"$error":"#REF!"}},{"$error":"#REF!"},{"$error":"#REF!"},{"$error":"#REF!"},{"$error":"#REF!"},{"$error":"#REF!"}]
[20,{"$error":"#REF!"},{"$error":"#REF!"},{"$error":"#REF!"},{"$error":"#REF!"},{"$error":"#REF!"},{"$error":"#REF!"},{"$error":"#REF!"},{"$error":"#REF!"},{"$error":"#REF!"},{"$f":"INDEX('PM 60-64'!$A$2:$E$107,J73+1,4)","v":{"$error":"#REF!"}},{"$error":"#REF!"},{"$error":"#REF!"},{"$error":"#REF!"},{"$error":"#REF!"},{"$error":"#REF!"}]
[21,{"$error":"#REF!"},{"$error":"#REF!"},{"$error":"#REF!"},{"$error":"#REF!"},{"$error":"#REF!"},{"$error":"#REF!"},{"$error":"#REF!"},{"$error":"#REF!"},{"$error":"#REF!"},{"$f":"INDEX('PM 60-64'!$A$2:$E$107,J74+1,4)","v":{"$error":"#REF!"}},{"$error":"#REF!"},{"$error":"#REF!"},{"$error":"#REF!"},{"$error":"#REF!"},{"$error":"#REF!"}]
[22,{"$error":"#REF!"},{"$error":"#REF!"},{"$error":"#REF!"},{"$error":"#REF!"},{"$error":"#REF!"},{"$error":"#REF!"},{"$error":"#REF!"},{"$error":"#REF!"},{"$error":"#REF!"},{"$f":"INDEX('PM 60-64'!$A$2:$E$107,J75+1,4)","v":{"$error":"#REF!"}},{"$error":"#REF!"},{"$error":"#REF!"},{"$error":"#REF!"},{"$error":"#REF!"},{"$error":"#REF!"}]
[23,{"$error":"#REF!"},{"$error":"#REF!"},{"$error":"#REF!"},{"$error":"#REF!"},{"$error":"#REF!"},{"$error":"#REF!"},{"$error":"#REF!"},{"$error":"#REF!"},{"$error":"#REF!"},{"$f":"INDEX('PM 60-64'!$A$2:$E$107,J76+1,4)","v":{"$error":"#REF!"}},{"$error":"#REF!"},{"$error":"#REF!"},{"$error":"#REF!"},{"$error":"#REF!"},{"$error":"#REF!"}]
[24,{"$error":"#REF!"},{"$error":"#REF!"},{"$error":"#REF!"},{"$error":"#REF!"},{"$error":"#REF!"},{"$error":"#REF!"},{"$error":"#REF!"},{"$error":"#REF!"},{"$error":"#REF!"},{"$f":"INDEX('PM 60-64'!$A$2:$E$107,J77+1,4)","v":{"$error":"#REF!"}},{"$error":"#REF!"},{"$error":"#REF!"},{"$error":"#REF!"},{"$error":"#REF!"},{"$error":"#REF!"}]
[25,{"$error":"#REF!"},{"$error":"#REF!"},{"$error":"#REF!"},{"$error":"#REF!"},{"$error":"#REF!"},{"$error":"#REF!"},{"$error":"#REF!"},{"$error":"#REF!"},{"$error":"#REF!"},{"$f":"INDEX('PM 60-64'!$A$2:$E$107,J78+1,4)","v":{"$error":"#REF!"}},{"$error":"#REF!"},{"$error":"#REF!"},{"$error":"#REF!"},{"$error":"#REF!"},{"$error":"#REF!"}]
[26,{"$error":"#REF!"},{"$error":"#REF!"},{"$error":"#REF!"},{"$error":"#REF!"},{"$error":"#REF!"},{"$error":"#REF!"},{"$error":"#REF!"},{"$error":"#REF!"},{"$error":"#REF!"},{"$f":"INDEX('PM 60-64'!$A$2:$E$107,J79+1,4)","v":{"$error":"#REF!"}},{"$error":"#REF!"},{"$error":"#REF!"},{"$error":"#REF!"},{"$error":"#REF!"},{"$error":"#REF!"}]
[27,{"$error":"#REF!"},{"$error":"#REF!"},{"$error":"#REF!"},{"$error":"#REF!"},{"$error":"#REF!"},{"$error":"#REF!"},{"$error":"#REF!"},{"$error":"#REF!"},{"$error":"#REF!"},{"$f":"INDEX('PM 60-64'!$A$2:$E$107,J80+1,4)","v":{"$error":"#REF!"}},{"$error":"#REF!"},{"$error":"#REF!"},{"$error":"#REF!"},{"$error":"#REF!"},{"$error":"#REF!"}]
[28,{"$error":"#REF!"},{"$error":"#REF!"},{"$error":"#REF!"},{"$error":"#REF!"},{"$error":"#REF!"},{"$error":"#REF!"},{"$error":"#REF!"},{"$error":"#REF!"},{"$error":"#REF!"},{"$f":"INDEX('PM 60-64'!$A$2:$E$107,J81+1,4)","v":{"$error":"#REF!"}},{"$error":"#REF!"},{"$error":"#REF!"},{"$error":"#REF!"},{"$error":"#REF!"},{"$error":"#REF!"}]
[29,{"$error":"#REF!"},{"$error":"#REF!"},{"$error":"#REF!"},{"$error":"#REF!"},{"$error":"#REF!"},{"$error":"#REF!"},{"$error":"#REF!"},{"$error":"#REF!"},{"$error":"#REF!"},{"$f":"INDEX('PM 60-64'!$A$2:$E$107,J82+1,4)","v":{"$error":"#REF!"}},{"$error":"#REF!"},{"$error":"#REF!"},{"$error":"#REF!"},{"$error":"#REF!"},{"$error":"#REF!"}]
[30,{"$error":"#REF!"},{"$error":"#REF!"},{"$error":"#REF!"},{"$error":"#REF!"},{"$error":"#REF!"},{"$error":"#REF!"},{"$error":"#REF!"},{"$error":"#REF!"},{"$error":"#REF!"},{"$f":"INDEX('PM 60-64'!$A$2:$E$107,J83+1,4)","v":{"$error":"#REF!"}},{"$error":"#REF!"},{"$error":"#REF!"},{"$error":"#REF!"},{"$error":"#REF!"},{"$error":"#REF!"}]
[31,{"$error":"#REF!"},{"$error":"#REF!"},{"$error":"#REF!"},{"$error":"#REF!"},{"$error":"#REF!"},{"$error":"#REF!"},{"$error":"#REF!"},{"$error":"#REF!"},{"$error":"#REF!"},{"$f":"INDEX('PM 60-64'!$A$2:$E$107,J84+1,4)","v":{"$error":"#REF!"}},{"$error":"#REF!"},{"$error":"#REF!"},{"$error":"#REF!"},{"$error":"#REF!"},{"$error":"#REF!"}]
[32,{"$error":"#REF!"},{"$error":"#REF!"},{"$error":"#REF!"},{"$error":"#REF!"},{"$error":"#REF!"},{"$error":"#REF!"},{"$error":"#REF!"},{"$error":"#REF!"},{"$error":"#REF!"},{"$f":"INDEX('PM 60-64'!$A$2:$E$107,J85+1,4)","v":{"$error":"#REF!"}},{"$error":"#REF!"},{"$error":"#REF!"},{"$error":"#REF!"},{"$error":"#REF!"},{"$error":"#REF!"}]
[33,{"$error":"#REF!"},{"$error":"#REF!"},{"$error":"#REF!"},{"$error":"#REF!"},{"$error":"#REF!"},{"$error":"#REF!"},{"$error":"#REF!"},{"$error":"#REF!"},{"$error":"#REF!"},{"$f":"INDEX('PM 60-64'!$A$2:$E$107,J86+1,4)","v":{"$error":"#REF!"}},{"$error":"#REF!"},{"$error":"#REF!"},{"$error":"#REF!"},{"$error":"#REF!"},{"$error":"#REF!"}]
[34,{"$error":"#REF!"},{"$error":"#REF!"},{"$error":"#REF!"},{"$error":"#REF!"},{"$error":"#REF!"},{"$error":"#REF!"},{"$error":"#REF!"},{"$error":"#REF!"},{"$error":"#REF!"},{"$f":"INDEX('PM 60-64'!$A$2:$E$107,J87+1,4)","v":{"$error":"#REF!"}},{"$error":"#REF!"},{"$error":"#REF!"},{"$error":"#REF!"},{"$error":"#REF!"},{"$error":"#REF!"}]
[35,{"$error":"#REF!"},{"$error":"#REF!"},{"$error":"#REF!"},{"$error":"#REF!"},{"$error":"#REF!"},{"$error":"#REF!"},{"$error":"#REF!"},{"$error":"#REF!"},{"$error":"#REF!"},{"$f":"INDEX('PM 60-64'!$A$2:$E$107,J88+1,4)","v":{"$error":"#REF!"}},{"$error":"#REF!"},{"$error":"#REF!"},{"$error":"#REF!"},{"$error":"#REF!"},{"$error":"#REF!"}]
[36,{"$error":"#REF!"},{"$error":"#REF!"},{"$error":"#REF!"},{"$error":"#REF!"},{"$error":"#REF!"},{"$error":"#REF!"},{"$error":"#REF!"},{"$error":"#REF!"},{"$error":"#REF!"},{"$f":"INDEX('PM 60-64'!$A$2:$E$107,J89+1,4)","v":{"$error":"#REF!"}},{"$error":"#REF!"},{"$error":"#REF!"},{"$error":"#REF!"},{"$error":"#REF!"},{"$error":"#REF!"}]
[37,{"$error":"#REF!"},{"$error":"#REF!"},{"$error":"#REF!"},{"$error":"#REF!"},{"$error":"#REF!"},{"$error":"#REF!"},{"$error":"#REF!"},{"$error":"#REF!"},{"$error":"#REF!"},{"$f":"INDEX('PM 60-64'!$A$2:$E$107,J90+1,4)","v":{"$error":"#REF!"}},{"$error":"#REF!"},{"$error":"#REF!"},{"$error":"#REF!"},{"$error":"#REF!"},{"$error":"#REF!"}]
[38,{"$error":"#REF!"},{"$error":"#REF!"},{"$error":"#REF!"},{"$error":"#REF!"},{"$error":"#REF!"},{"$error":"#REF!"},{"$error":"#REF!"},{"$error":"#REF!"},{"$error":"#REF!"},{"$f":"INDEX('PM 60-64'!$A$2:$E$107,J91+1,4)","v":{"$error":"#REF!"}},{"$error":"#REF!"},{"$error":"#REF!"},{"$error":"#REF!"},{"$error":"#REF!"},{"$error":"#REF!"}]
[39,{"$error":"#REF!"},{"$error":"#REF!"},{"$error":"#REF!"},{"$error":"#REF!"},{"$error":"#REF!"},{"$error":"#REF!"},{"$error":"#REF!"},{"$error":"#REF!"},{"$error":"#REF!"},{"$f":"INDEX('PM 60-64'!$A$2:$E$107,J92+1,4)","v":{"$error":"#REF!"}},{"$error":"#REF!"},{"$error":"#REF!"},{"$error":"#REF!"},{"$error":"#REF!"},{"$error":"#REF!"}]
[40,{"$error":"#REF!"},{"$error":"#REF!"},{"$error":"#REF!"},{"$error":"#REF!"},{"$error":"#REF!"},{"$error":"#REF!"},{"$error":"#REF!"},{"$error":"#REF!"},{"$error":"#REF!"},{"$f":"INDEX('PM 60-64'!$A$2:$E$107,J93+1,4)","v":{"$error":"#REF!"}},{"$error":"#REF!"},{"$error":"#REF!"},{"$error":"#REF!"},{"$error":"#REF!"},{"$error":"#REF!"}]
[41,{"$error":"#REF!"},{"$error":"#REF!"},{"$error":"#REF!"},{"$error":"#REF!"},{"$error":"#REF!"},{"$error":"#REF!"},{"$error":"#REF!"},{"$error":"#REF!"},{"$error":"#REF!"},{"$f":"INDEX('PM 60-64'!$A$2:$E$107,J94+1,4)","v":{"$error":"#REF!"}},{"$error":"#REF!"},{"$error":"#REF!"},{"$error":"#REF!"},{"$error":"#REF!"},{"$error":"#REF!"}]
[42,{"$error":"#REF!"},{"$error":"#REF!"},{"$error":"#REF!"},{"$error":"#REF!"},{"$error":"#REF!"},{"$error":"#REF!"},{"$error":"#REF!"},{"$error":"#REF!"},{"$error":"#REF!"},{"$f":"INDEX('PM 60-64'!$A$2:$E$107,J95+1,4)","v":{"$error":"#REF!"}},{"$error":"#REF!"},{"$error":"#REF!"},{"$error":"#REF!"},{"$error":"#REF!"},{"$error":"#REF!"}]
[43,{"$error":"#REF!"},{"$error":"#REF!"},{"$error":"#REF!"},{"$error":"#REF!"},{"$error":"#REF!"},{"$error":"#REF!"},{"$error":"#REF!"},{"$error":"#REF!"},{"$error":"#REF!"},{"$f":"INDEX('PM 60-64'!$A$2:$E$107,J96+1,4)","v":{"$error":"#REF!"}},{"$error":"#REF!"},{"$error":"#REF!"},{"$error":"#REF!"},{"$error":"#REF!"},{"$error":"#REF!"}]
[44,{"$error":"#REF!"},{"$error":"#REF!"},{"$error":"#REF!"},{"$error":"#REF!"},{"$error":"#REF!"},{"$error":"#REF!"},{"$error":"#REF!"},{"$error":"#REF!"},{"$error":"#REF!"},{"$f":"INDEX('PM 60-64'!$A$2:$E$107,J97+1,4)","v":{"$error":"#REF!"}},{"$error":"#REF!"},{"$error":"#REF!"},{"$error":"#REF!"},{"$error":"#REF!"},{"$error":"#REF!"}]
[45,{"$error":"#REF!"},{"$error":"#REF!"},{"$error":"#REF!"},{"$error":"#REF!"},{"$error":"#REF!"},{"$error":"#REF!"},{"$error":"#REF!"},{"$error":"#REF!"},{"$error":"#REF!"},{"$f":"INDEX('PM 60-64'!$A$2:$E$107,J98+1,4)","v":{"$error":"#REF!"}},{"$error":"#REF!"},{"$error":"#REF!"},{"$error":"#REF!"},{"$error":"#REF!"},{"$error":"#REF!"}]
[46,{"$error":"#REF!"},{"$error":"#REF!"},{"$error":"#REF!"},{"$error":"#REF!"},{"$error":"#REF!"},{"$error":"#REF!"},{"$error":"#REF!"},{"$error":"#REF!"},{"$error":"#REF!"},{"$f":"INDEX('PM 60-64'!$A$2:$E$107,J99+1,4)","v":{"$error":"#REF!"}},{"$error":"#REF!"},{"$error":"#REF!"},{"$error":"#REF!"},{"$error":"#REF!"},{"$error":"#REF!"}]
[47,{"$error":"#REF!"},{"$error":"#REF!"},{"$error":"#REF!"},{"$error":"#REF!"},{"$error":"#REF!"},{"$error":"#REF!"},{"$error":"#REF!"},{"$error":"#REF!"},{"$error":"#REF!"},{"$f":"INDEX('PM 60-64'!$A$2:$E$107,J100+1,4)","v":{"$error":"#REF!"}},{"$error":"#REF!"},{"$error":"#REF!"},{"$error":"#REF!"},{"$error":"#REF!"},{"$error":"#REF!"}]
[48,{"$error":"#REF!"},{"$error":"#REF!"},{"$error":"#REF!"},{"$error":"#REF!"},{"$error":"#REF!"},{"$error":"#REF!"},{"$error":"#REF!"},{"$error":"#REF!"},{"$error":"#REF!"},{"$f":"INDEX('PM 60-64'!$A$2:$E$107,J101+1,4)","v":{"$error":"#REF!"}},{"$error":"#REF!"},{"$error":"#REF!"},{"$error":"#REF!"},{"$error":"#REF!"},{"$error":"#REF!"}]
[49,{"$error":"#REF!"},{"$error":"#REF!"},{"$error":"#REF!"},{"$error":"#REF!"},{"$error":"#REF!"},{"$error":"#REF!"},{"$error":"#REF!"},{"$error":"#REF!"},{"$error":"#REF!"},{"$f":"INDEX('PM 60-64'!$A$2:$E$107,J102+1,4)","v":{"$error":"#REF!"}},{"$error":"#REF!"},{"$error":"#REF!"},{"$error":"#REF!"},{"$error":"#REF!"},{"$error":"#REF!"}]
[50,{"$error":"#REF!"},{"$error":"#REF!"},{"$error":"#REF!"},{"$error":"#REF!"},{"$error":"#REF!"},{"$error":"#REF!"},{"$error":"#REF!"},{"$error":"#REF!"},{"$error":"#REF!"},{"$f":"INDEX('PM 60-64'!$A$2:$E$107,J103+1,4)","v":{"$error":"#REF!"}},{"$error":"#REF!"},{"$error":"#REF!"},{"$error":"#REF!"},{"$error":"#REF!"},{"$error":"#REF!"}]
[51,{"$error":"#REF!"},{"$error":"#REF!"},{"$error":"#REF!"},{"$error":"#REF!"},{"$error":"#REF!"},{"$error":"#REF!"},{"$error":"#REF!"},{"$error":"#REF!"},{"$error":"#REF!"},{"$f":"INDEX('PM 60-64'!$A$2:$E$107,J104+1,4)","v":{"$error":"#REF!"}},{"$error":"#REF!"},{"$error":"#REF!"},{"$error":"#REF!"},{"$error":"#REF!"},{"$error":"#REF!"}]
[52,{"$error":"#REF!"},{"$error":"#REF!"},{"$error":"#REF!"},{"$error":"#REF!"},{"$error":"#REF!"},{"$error":"#REF!"},{"$error":"#REF!"},{"$error":"#REF!"},{"$error":"#REF!"},{"$f":"INDEX('PM 60-64'!$A$2:$E$107,J105+1,4)","v":{"$error":"#REF!"}},{"$error":"#REF!"},{"$error":"#REF!"},{"$error":"#REF!"},{"$error":"#REF!"},{"$error":"#REF!"}]
[53,{"$error":"#REF!"},{"$error":"#REF!"},{"$error":"#REF!"},{"$error":"#REF!"},{"$error":"#REF!"},{"$error":"#REF!"},{"$error":"#REF!"},{"$error":"#REF!"},{"$error":"#REF!"},{"$f":"INDEX('PM 60-64'!$A$2:$E$107,J106+1,4)","v":{"$error":"#REF!"}},{"$error":"#REF!"},{"$error":"#REF!"},{"$error":"#REF!"},{"$error":"#REF!"},{"$error":"#REF!"}]
[54,{"$error":"#REF!"},{"$error":"#REF!"},{"$error":"#REF!"},{"$error":"#REF!"},{"$error":"#REF!"},{"$error":"#REF!"},{"$error":"#REF!"},{"$error":"#REF!"},{"$error":"#REF!"},{"$f":"INDEX('PM 60-64'!$A$2:$E$107,J107+1,4)","v":{"$error":"#REF!"}},{"$error":"#REF!"},{"$error":"#REF!"},{"$error":"#REF!"},{"$error":"#REF!"},{"$error":"#REF!"}]
[55,{"$error":"#REF!"},{"$error":"#REF!"},{"$error":"#REF!"},{"$error":"#REF!"},{"$error":"#REF!"},{"$error":"#REF!"},{"$error":"#REF!"},{"$error":"#REF!"},{"$error":"#REF!"},{"$f":"INDEX('PM 60-64'!$A$2:$E$107,J108+1,4)","v":{"$error":"#REF!"}},{"$error":"#REF!"},{"$error":"#REF!"},{"$error":"#REF!"},{"$error":"#REF!"},{"$error":"#REF!"}]
[56,{"$error":"#REF!"},{"$error":"#REF!"},{"$error":"#REF!"},{"$error":"#REF!"},{"$error":"#REF!"},{"$error":"#REF!"},{"$error":"#REF!"},{"$error":"#REF!"},{"$error":"#REF!"},{"$f":"INDEX('PM 60-64'!$A$2:$E$107,J109+1,4)","v":{"$error":"#REF!"}},{"$error":"#REF!"},{"$error":"#REF!"},{"$error":"#REF!"},{"$error":"#REF!"},{"$error":"#REF!"}]
[57,{"$error":"#REF!"},{"$error":"#REF!"},{"$error":"#REF!"},{"$error":"#REF!"},{"$error":"#REF!"},{"$error":"#REF!"},{"$error":"#REF!"},{"$error":"#REF!"},{"$error":"#REF!"},{"$f":"INDEX('PM 60-64'!$A$2:$E$107,J110+1,4)","v":{"$error":"#REF!"}},{"$error":"#REF!"},{"$error":"#REF!"},{"$error":"#REF!"},{"$error":"#REF!"},{"$error":"#REF!"}]
[58,{"$error":"#REF!"},{"$error":"#REF!"},{"$error":"#REF!"},{"$error":"#REF!"},{"$error":"#REF!"},{"$error":"#REF!"},{"$error":"#REF!"},{"$error":"#REF!"},{"$error":"#REF!"},{"$f":"INDEX('PM 60-64'!$A$2:$E$107,J111+1,4)","v":{"$error":"#REF!"}},{"$error":"#REF!"},{"$error":"#REF!"},{"$error":"#REF!"},{"$error":"#REF!"},{"$error":"#REF!"}]
[59,{"$error":"#REF!"},{"$error":"#REF!"},{"$error":"#REF!"},{"$error":"#REF!"},{"$error":"#REF!"},{"$error":"#REF!"},{"$error":"#REF!"},{"$error":"#REF!"},{"$error":"#REF!"},{"$f":"INDEX('PM 60-64'!$A$2:$E$107,J112+1,4)","v":{"$error":"#REF!"}},{"$error":"#REF!"},{"$error":"#REF!"},{"$error":"#REF!"},{"$error":"#REF!"},{"$error":"#REF!"}]
[60,{"$error":"#REF!"},{"$error":"#REF!"},{"$error":"#REF!"},{"$error":"#REF!"},{"$error":"#REF!"},{"$error":"#REF!"},{"$error":"#REF!"},{"$error":"#REF!"},{"$error":"#REF!"},{"$f":"INDEX('PM 60-64'!$A$2:$E$107,J113+1,4)","v":{"$error":"#REF!"}},{"$error":"#REF!"},{"$error":"#REF!"},{"$error":"#REF!"},{"$error":"#REF!"},{"$error":"#REF!"}]
[61,{"$error":"#REF!"},{"$error":"#REF!"},{"$error":"#REF!"},{"$error":"#REF!"},{"$error":"#REF!"},{"$error":"#REF!"},{"$error":"#REF!"},{"$error":"#REF!"},{"$error":"#REF!"},{"$f":"INDEX('PM 60-64'!$A$2:$E$107,J114+1,4)","v":{"$error":"#REF!"}},{"$error":"#REF!"},{"$error":"#REF!"},{"$error":"#REF!"},{"$error":"#REF!"},{"$error":"#REF!"}]
[62,{"$error":"#REF!"},{"$error":"#REF!"},{"$error":"#REF!"},{"$error":"#REF!"},{"$error":"#REF!"},{"$error":"#REF!"},{"$error":"#REF!"},{"$error":"#REF!"},{"$error":"#REF!"},{"$f":"INDEX('PM 60-64'!$A$2:$E$107,J115+1,4)","v":{"$error":"#REF!"}},{"$error":"#REF!"},{"$error":"#REF!"},{"$error":"#REF!"},{"$error":"#REF!"},{"$error":"#REF!"}]
[63,{"$error":"#REF!"},{"$error":"#REF!"},{"$error":"#REF!"},{"$error":"#REF!"},{"$error":"#REF!"},{"$error":"#REF!"},{"$error":"#REF!"},{"$error":"#REF!"},{"$error":"#REF!"},{"$f":"INDEX('PM 60-64'!$A$2:$E$107,J116+1,4)","v":{"$error":"#REF!"}},{"$error":"#REF!"},{"$error":"#REF!"},{"$error":"#REF!"},{"$error":"#REF!"},{"$error":"#REF!"}]
[64,{"$error":"#REF!"},{"$error":"#REF!"},{"$error":"#REF!"},{"$error":"#REF!"},{"$error":"#REF!"},{"$error":"#REF!"},{"$error":"#REF!"},{"$error":"#REF!"},{"$error":"#REF!"},{"$f":"INDEX('PM 60-64'!$A$2:$E$107,J117+1,4)","v":{"$error":"#REF!"}},{"$error":"#REF!"},{"$error":"#REF!"},{"$error":"#REF!"},{"$error":"#REF!"},{"$error":"#REF!"}]
[65,{"$error":"#REF!"},{"$error":"#REF!"},{"$f":"$I$9","v":{"$error":"#REF!"}},{"$error":"#REF!"},{"$error":"#REF!"},{"$error":"#REF!"},{"$error":"#REF!"},{"$f":"ROUND(D118-F118-G118-H118,1)","v":{"$error":"#REF!"}},{"$error":"#REF!"},{"$f":"INDEX('PM 60-64'!$A$2:$E$107,J118+1,4)","v":{"$error":"#REF!"}},{"$error":"#REF!"},{"$error":"#REF!"},{"$f":"I118+M118","v":{"$error":"#REF!"}},{"$error":"#REF!"},{"$error":"#REF!"}]
[66,{"$error":"#REF!"},{"$f":"B119","v":{"$error":"#REF!"}},{"$error":"#REF!"},{"$error":"#REF!"},{"$f":"IF($I$8=\"O\",IF(12*(YEAR(C119)-YEAR($J$3))+MONTH(C119)-MONTH($J$3)+1>12,0,D119*$I$6*MIN($I$7,$O$3)),D119*$I$6)","v":{"$error":"#REF!"}},{"$f":"IF($M$10=\"Ppure\",ROUND((D119-F119)*$M$6/(1+$M$6+$M$7),0),ROUND(D119*$M$6,0))","v":{"$error":"#REF!"}},{"$f":"IF($M$10=\"Ppure\",ROUND((D119-F119)*$M$7/(1+$M$6+$M$7),0),ROUND(D119*$M$7,0))","v":{"$error":"#REF!"}},{"$error":"#REF!"},{"$f":"INT(YEAR(C119)-YEAR($Q$6)+$O$4+0*(MONTH(C119)-MONTH($Q$6))/12)","v":{"$error":"#REF!"}},{"$f":"INDEX('PM 60-64'!$A$2:$E$107,J119+1,4)","v":{"$error":"#REF!"}},{"$f":"IF(A119>120,0,ROUND((K119*(1+$Q$7)*(1+$C$8)^(-0.5)+$Q$10)*(1+$M$9)*$Q$9,0))","v":{"$error":"#REF!"}},{"$f":"ROUND(-L119/12,0)","v":{"$error":"#REF!"}},{"$error":"#REF!"},{"$error":"#REF!"},{"$f":"(O119+N119)*(1+$C$10)","v":{"$error":"#REF!"}}]
[67,{"$f":"DATE(YEAR(B119),MONTH(B119)+1,DAY(B119))","v":{"$error":"#REF!"}},{"$error":"#REF!"},{"$error":"#REF!"},{"$f":"E119+D119","v":{"$error":"#REF!"}},{"$error":"#REF!"},{"$error":"#REF!"},{"$error":"#REF!"},{"$error":"#REF!"},{"$error":"#REF!"},{"$f":"INDEX('PM 60-64'!$A$2:$E$107,J120+1,4)","v":{"$error":"#REF!"}},{"$error":"#REF!"},{"$error":"#REF!"},{"$error":"#REF!"},{"$f":"P119","v":{"$error":"#REF!"}},{"$error":"#REF!"}]
[68,{"$error":"#REF!"},{"$error":"#REF!"},{"$error":"#REF!"},{"$error":"#REF!"},{"$error":"#REF!"},{"$error":"#REF!"},{"$error":"#REF!"},{"$error":"#REF!"},{"$error":"#REF!"},{"$f":"INDEX('PM 60-64'!$A$2:$E$107,J121+1,4)","v":{"$error":"#REF!"}},{"$error":"#REF!"},{"$error":"#REF!"},{"$error":"#REF!"},{"$error":"#REF!"},{"$error":"#REF!"}]
[69,{"$error":"#REF!"},{"$error":"#REF!"},{"$error":"#REF!"},{"$error":"#REF!"},{"$error":"#REF!"},{"$error":"#REF!"},{"$error":"#REF!"},{"$error":"#REF!"},{"$error":"#REF!"},{"$f":"INDEX('PM 60-64'!$A$2:$E$107,J122+1,4)","v":{"$error":"#REF!"}},{"$error":"#REF!"},{"$error":"#REF!"},{"$error":"#REF!"},{"$error":"#REF!"},{"$error":"#REF!"}]
[70,{"$error":"#REF!"},{"$error":"#REF!"},{"$error":"#REF!"},{"$error":"#REF!"},{"$error":"#REF!"},{"$error":"#REF!"},{"$error":"#REF!"},{"$error":"#REF!"},{"$error":"#REF!"},{"$f":"INDEX('PM 60-64'!$A$2:$E$107,J123+1,4)","v":{"$error":"#REF!"}},{"$error":"#REF!"},{"$error":"#REF!"},{"$error":"#REF!"},{"$error":"#REF!"},{"$error":"#REF!"}]
[71,{"$error":"#REF!"},{"$error":"#REF!"},{"$error":"#REF!"},{"$error":"#REF!"},{"$error":"#REF!"},{"$error":"#REF!"},{"$error":"#REF!"},{"$error":"#REF!"},{"$error":"#REF!"},{"$f":"INDEX('PM 60-64'!$A$2:$E$107,J124+1,4)","v":{"$error":"#REF!"}},{"$error":"#REF!"},{"$error":"#REF!"},{"$error":"#REF!"},{"$error":"#REF!"},{"$error":"#REF!"}]
[72,{"$error":"#REF!"},{"$error":"#REF!"},{"$error":"#REF!"},{"$error":"#REF!"},{"$error":"#REF!"},{"$error":"#REF!"},{"$error":"#REF!"},{"$error":"#REF!"},{"$error":"#REF!"},{"$f":"INDEX('PM 60-64'!$A$2:$E$107,J125+1,4)","v":{"$error":"#REF!"}},{"$error":"#REF!"},{"$error":"#REF!"},{"$error":"#REF!"},{"$error":"#REF!"},{"$error":"#REF!"}]
[73,{"$error":"#REF!"},{"$error":"#REF!"},{"$error":"#REF!"},{"$error":"#REF!"},{"$error":"#REF!"},{"$error":"#REF!"},{"$error":"#REF!"},{"$error":"#REF!"},{"$error":"#REF!"},{"$f":"INDEX('PM 60-64'!$A$2:$E$107,J126+1,4)","v":{"$error":"#REF!"}},{"$error":"#REF!"},{"$error":"#REF!"},{"$error":"#REF!"},{"$error":"#REF!"},{"$error":"#REF!"}]
[74,{"$error":"#REF!"},{"$error":"#REF!"},{"$error":"#REF!"},{"$error":"#REF!"},{"$error":"#REF!"},{"$error":"#REF!"},{"$error":"#REF!"},{"$error":"#REF!"},{"$error":"#REF!"},{"$f":"INDEX('PM 60-64'!$A$2:$E$107,J127+1,4)","v":{"$error":"#REF!"}},{"$error":"#REF!"},{"$error":"#REF!"},{"$error":"#REF!"},{"$error":"#REF!"},{"$error":"#REF!"}]
[75,{"$error":"#REF!"},{"$error":"#REF!"},{"$error":"#REF!"},{"$error":"#REF!"},{"$error":"#REF!"},{"$error":"#REF!"},{"$error":"#REF!"},{"$error":"#REF!"},{"$error":"#REF!"},{"$f":"INDEX('PM 60-64'!$A$2:$E$107,J128+1,4)","v":{"$error":"#REF!"}},{"$error":"#REF!"},{"$error":"#REF!"},{"$error":"#REF!"},{"$error":"#REF!"},{"$error":"#REF!"}]
[76,{"$error":"#REF!"},{"$error":"#REF!"},{"$error":"#REF!"},{"$error":"#REF!"},{"$error":"#REF!"},{"$error":"#REF!"},{"$error":"#REF!"},{"$error":"#REF!"},{"$error":"#REF!"},{"$f":"INDEX('PM 60-64'!$A$2:$E$107,J129+1,4)","v":{"$error":"#REF!"}},{"$error":"#REF!"},{"$error":"#REF!"},{"$error":"#REF!"},{"$error":"#REF!"},{"$error":"#REF!"}]
[77,{"$error":"#REF!"},{"$error":"#REF!"},{"$error":"#REF!"},{"$error":"#REF!"},{"$error":"#REF!"},{"$error":"#REF!"},{"$error":"#REF!"},{"$error":"#REF!"},{"$error":"#REF!"},{"$f":"INDEX('PM 60-64'!$A$2:$E$107,J130+1,4)","v":{"$error":"#REF!"}},{"$error":"#REF!"},{"$error":"#REF!"},{"$error":"#REF!"},{"$error":"#REF!"},{"$error":"#REF!"}]
[78,{"$error":"#REF!"},{"$error":"#REF!"},{"$error":"#REF!"},{"$error":"#REF!"},{"$error":"#REF!"},{"$error":"#REF!"},{"$error":"#REF!"},{"$error":"#REF!"},{"$error":"#REF!"},{"$f":"INDEX('PM 60-64'!$A$2:$E$107,J131+1,4)","v":{"$error":"#REF!"}},{"$error":"#REF!"},{"$error":"#REF!"},{"$error":"#REF!"},{"$error":"#REF!"},{"$error":"#REF!"}]
[79,{"$error":"#REF!"},{"$error":"#REF!"},{"$error":"#REF!"},{"$error":"#REF!"},{"$error":"#REF!"},{"$error":"#REF!"},{"$error":"#REF!"},{"$error":"#REF!"},{"$error":"#REF!"},{"$f":"INDEX('PM 60-64'!$A$2:$E$107,J132+1,4)","v":{"$error":"#REF!"}},{"$error":"#REF!"},{"$error":"#REF!"},{"$error":"#REF!"},{"$error":"#REF!"},{"$error":"#REF!"}]
[80,{"$error":"#REF!"},{"$error":"#REF!"},{"$error":"#REF!"},{"$error":"#REF!"},{"$error":"#REF!"},{"$error":"#REF!"},{"$error":"#REF!"},{"$error":"#REF!"},{"$error":"#REF!"},{"$f":"INDEX('PM 60-64'!$A$2:$E$107,J133+1,4)","v":{"$error":"#REF!"}},{"$error":"#REF!"},{"$error":"#REF!"},{"$error":"#REF!"},{"$error":"#REF!"},{"$error":"#REF!"}]
[81,{"$error":"#REF!"},{"$error":"#REF!"},{"$error":"#REF!"},{"$error":"#REF!"},{"$error":"#REF!"},{"$error":"#REF!"},{"$error":"#REF!"},{"$error":"#REF!"},{"$error":"#REF!"},{"$f":"INDEX('PM 60-64'!$A$2:$E$107,J134+1,4)","v":{"$error":"#REF!"}},{"$error":"#REF!"},{"$error":"#REF!"},{"$error":"#REF!"},{"$error":"#REF!"},{"$error":"#REF!"}]
[82,{"$error":"#REF!"},{"$error":"#REF!"},{"$error":"#REF!"},{"$error":"#REF!"},{"$error":"#REF!"},{"$error":"#REF!"},{"$error":"#REF!"},{"$error":"#REF!"},{"$error":"#REF!"},{"$f":"INDEX('PM 60-64'!$A$2:$E$107,J135+1,4)","v":{"$error":"#REF!"}},{"$error":"#REF!"},{"$error":"#REF!"},{"$error":"#REF!"},{"$error":"#REF!"},{"$error":"#REF!"}]
[83,{"$error":"#REF!"},{"$error":"#REF!"},{"$error":"#REF!"},{"$error":"#REF!"},{"$error":"#REF!"},{"$error":"#REF!"},{"$error":"#REF!"},{"$error":"#REF!"},{"$error":"#REF!"},{"$f":"INDEX('PM 60-64'!$A$2:$E$107,J136+1,4)","v":{"$error":"#REF!"}},{"$error":"#REF!"},{"$error":"#REF!"},{"$error":"#REF!"},{"$error":"#REF!"},{"$error":"#REF!"}]
[84,{"$error":"#REF!"},{"$error":"#REF!"},{"$error":"#REF!"},{"$error":"#REF!"},{"$error":"#REF!"},{"$error":"#REF!"},{"$error":"#REF!"},{"$error":"#REF!"},{"$error":"#REF!"},{"$f":"INDEX('PM 60-64'!$A$2:$E$107,J137+1,4)","v":{"$error":"#REF!"}},{"$error":"#REF!"},{"$error":"#REF!"},{"$error":"#REF!"},{"$error":"#REF!"},{"$error":"#REF!"}]
[85,{"$error":"#REF!"},{"$error":"#REF!"},{"$error":"#REF!"},{"$error":"#REF!"},{"$error":"#REF!"},{"$error":"#REF!"},{"$error":"#REF!"},{"$error":"#REF!"},{"$error":"#REF!"},{"$f":"INDEX('PM 60-64'!$A$2:$E$107,J138+1,4)","v":{"$error":"#REF!"}},{"$error":"#REF!"},{"$error":"#REF!"},{"$error":"#REF!"},{"$error":"#REF!"},{"$error":"#REF!"}]
[86,{"$error":"#REF!"},{"$error":"#REF!"},{"$error":"#REF!"},{"$error":"#REF!"},{"$error":"#REF!"},{"$error":"#REF!"},{"$error":"#REF!"},{"$error":"#REF!"},{"$error":"#REF!"},{"$f":"INDEX('PM 60-64'!$A$2:$E$107,J139+1,4)","v":{"$error":"#REF!"}},{"$error":"#REF!"},{"$error":"#REF!"},{"$error":"#REF!"},{"$error":"#REF!"},{"$error":"#REF!"}]
[87,{"$error":"#REF!"},{"$error":"#REF!"},{"$error":"#REF!"},{"$error":"#REF!"},{"$error":"#REF!"},{"$error":"#REF!"},{"$error":"#REF!"},{"$error":"#REF!"},{"$error":"#REF!"},{"$f":"INDEX('PM 60-64'!$A$2:$E$107,J140+1,4)","v":{"$error":"#REF!"}},{"$error":"#REF!"},{"$error":"#REF!"},{"$error":"#REF!"},{"$error":"#REF!"},{"$error":"#REF!"}]
[88,{"$error":"#REF!"},{"$error":"#REF!"},{"$error":"#REF!"},{"$error":"#REF!"},{"$error":"#REF!"},{"$error":"#REF!"},{"$error":"#REF!"},{"$error":"#REF!"},{"$error":"#REF!"},{"$f":"INDEX('PM 60-64'!$A$2:$E$107,J141+1,4)","v":{"$error":"#REF!"}},{"$error":"#REF!"},{"$error":"#REF!"},{"$error":"#REF!"},{"$error":"#REF!"},{"$error":"#REF!"}]
[89,{"$error":"#REF!"},{"$error":"#REF!"},{"$error":"#REF!"},{"$error":"#REF!"},{"$error":"#REF!"},{"$error":"#REF!"},{"$error":"#REF!"},{"$error":"#REF!"},{"$error":"#REF!"},{"$f":"INDEX('PM 60-64'!$A$2:$E$107,J142+1,4)","v":{"$error":"#REF!"}},{"$error":"#REF!"},{"$error":"#REF!"},{"$error":"#REF!"},{"$error":"#REF!"},{"$error":"#REF!"}]
[90,{"$error":"#REF!"},{"$error":"#REF!"},{"$error":"#REF!"},{"$error":"#REF!"},{"$error":"#REF!"},{"$error":"#REF!"},{"$error":"#REF!"},{"$error":"#REF!"},{"$error":"#REF!"},{"$f":"INDEX('PM 60-64'!$A$2:$E$107,J143+1,4)","v":{"$error":"#REF!"}},{"$error":"#REF!"},{"$error":"#REF!"},{"$error":"#REF!"},{"$error":"#REF!"},{"$error":"#REF!"}]
[91,{"$error":"#REF!"},{"$error":"#REF!"},{"$error":"#REF!"},{"$error":"#REF!"},{"$error":"#REF!"},{"$error":"#REF!"},{"$error":"#REF!"},{"$error":"#REF!"},{"$error":"#REF!"},{"$f":"INDEX('PM 60-64'!$A$2:$E$107,J144+1,4)","v":{"$error":"#REF!"}},{"$error":"#REF!"},{"$error":"#REF!"},{"$error":"#REF!"},{"$error":"#REF!"},{"$error":"#REF!"}]
[92,{"$error":"#REF!"},{"$error":"#REF!"},{"$error":"#REF!"},{"$error":"#REF!"},{"$error":"#REF!"},{"$error":"#REF!"},{"$error":"#REF!"},{"$error":"#REF!"},{"$error":"#REF!"},{"$f":"INDEX('PM 60-64'!$A$2:$E$107,J145+1,4)","v":{"$error":"#REF!"}},{"$error":"#REF!"},{"$error":"#REF!"},{"$error":"#REF!"},{"$error":"#REF!"},{"$error":"#REF!"}]
[93,{"$error":"#REF!"},{"$error":"#REF!"},{"$error":"#REF!"},{"$error":"#REF!"},{"$error":"#REF!"},{"$error":"#REF!"},{"$error":"#REF!"},{"$error":"#REF!"},{"$error":"#REF!"},{"$f":"INDEX('PM 60-64'!$A$2:$E$107,J146+1,4)","v":{"$error":"#REF!"}},{"$error":"#REF!"},{"$error":"#REF!"},{"$error":"#REF!"},{"$error":"#REF!"},{"$error":"#REF!"}]
[94,{"$error":"#REF!"},{"$error":"#REF!"},{"$error":"#REF!"},{"$error":"#REF!"},{"$error":"#REF!"},{"$error":"#REF!"},{"$error":"#REF!"},{"$error":"#REF!"},{"$error":"#REF!"},{"$f":"INDEX('PM 60-64'!$A$2:$E$107,J147+1,4)","v":{"$error":"#REF!"}},{"$error":"#REF!"},{"$error":"#REF!"},{"$error":"#REF!"},{"$error":"#REF!"},{"$error":"#REF!"}]
[95,{"$error":"#REF!"},{"$error":"#REF!"},{"$error":"#REF!"},{"$error":"#REF!"},{"$error":"#REF!"},{"$error":"#REF!"},{"$error":"#REF!"},{"$error":"#REF!"},{"$error":"#REF!"},{"$f":"INDEX('PM 60-64'!$A$2:$E$107,J148+1,4)","v":{"$error":"#REF!"}},{"$error":"#REF!"},{"$error":"#REF!"},{"$error":"#REF!"},{"$error":"#REF!"},{"$error":"#REF!"}]
[96,{"$error":"#REF!"},{"$error":"#REF!"},{"$error":"#REF!"},{"$error":"#REF!"},{"$error":"#REF!"},{"$error":"#REF!"},{"$error":"#REF!"},{"$error":"#REF!"},{"$error":"#REF!"},{"$f":"INDEX('PM 60-64'!$A$2:$E$107,J149+1,4)","v":{"$error":"#REF!"}},{"$error":"#REF!"},{"$error":"#REF!"},{"$error":"#REF!"},{"$error":"#REF!"},{"$error":"#REF!"}]
[97,{"$error":"#REF!"},{"$error":"#REF!"},{"$error":"#REF!"},{"$error":"#REF!"},{"$error":"#REF!"},{"$error":"#REF!"},{"$error":"#REF!"},{"$error":"#REF!"},{"$error":"#REF!"},{"$f":"INDEX('PM 60-64'!$A$2:$E$107,J150+1,4)","v":{"$error":"#REF!"}},{"$error":"#REF!"},{"$error":"#REF!"},{"$error":"#REF!"},{"$error":"#REF!"},{"$error":"#REF!"}]
[98,{"$error":"#REF!"},{"$error":"#REF!"},{"$error":"#REF!"},{"$error":"#REF!"},{"$error":"#REF!"},{"$error":"#REF!"},{"$error":"#REF!"},{"$error":"#REF!"},{"$error":"#REF!"},{"$f":"INDEX('PM 60-64'!$A$2:$E$107,J151+1,4)","v":{"$error":"#REF!"}},{"$error":"#REF!"},{"$error":"#REF!"},{"$error":"#REF!"},{"$error":"#REF!"},{"$error":"#REF!"}]
[99,{"$error":"#REF!"},{"$error":"#REF!"},{"$error":"#REF!"},{"$error":"#REF!"},{"$error":"#REF!"},{"$error":"#REF!"},{"$error":"#REF!"},{"$error":"#REF!"},{"$error":"#REF!"},{"$f":"INDEX('PM 60-64'!$A$2:$E$107,J152+1,4)","v":{"$error":"#REF!"}},{"$error":"#REF!"},{"$error":"#REF!"},{"$error":"#REF!"},{"$error":"#REF!"},{"$error":"#REF!"}]
[100,{"$error":"#REF!"},{"$error":"#REF!"},{"$error":"#REF!"},{"$error":"#REF!"},{"$error":"#REF!"},{"$error":"#REF!"},{"$error":"#REF!"},{"$error":"#REF!"},{"$error":"#REF!"},{"$f":"INDEX('PM 60-64'!$A$2:$E$107,J153+1,4)","v":{"$error":"#REF!"}},{"$error":"#REF!"},{"$error":"#REF!"},{"$error":"#REF!"},{"$error":"#REF!"},{"$error":"#REF!"}]
[101,{"$error":"#REF!"},{"$error":"#REF!"},{"$error":"#REF!"},{"$error":"#REF!"},{"$error":"#REF!"},{"$error":"#REF!"},{"$error":"#REF!"},{"$error":"#REF!"},{"$error":"#REF!"},{"$f":"INDEX('PM 60-64'!$A$2:$E$107,J154+1,4)","v":{"$error":"#REF!"}},{"$error":"#REF!"},{"$error":"#REF!"},{"$error":"#REF!"},{"$error":"#REF!"},{"$error":"#REF!"}]
[102,{"$error":"#REF!"},{"$error":"#REF!"},{"$error":"#REF!"},{"$error":"#REF!"},{"$error":"#REF!"},{"$error":"#REF!"},{"$error":"#REF!"},{"$error":"#REF!"},{"$error":"#REF!"},{"$f":"INDEX('PM 60-64'!$A$2:$E$107,J155+1,4)","v":{"$error":"#REF!"}},{"$error":"#REF!"},{"$error":"#REF!"},{"$error":"#REF!"},{"$error":"#REF!"},{"$error":"#REF!"}]
[103,{"$error":"#REF!"},{"$error":"#REF!"},{"$error":"#REF!"},{"$error":"#REF!"},{"$error":"#REF!"},{"$error":"#REF!"},{"$error":"#REF!"},{"$error":"#REF!"},{"$error":"#REF!"},{"$f":"INDEX('PM 60-64'!$A$2:$E$107,J156+1,4)","v":{"$error":"#REF!"}},{"$error":"#REF!"},{"$error":"#REF!"},{"$error":"#REF!"},{"$error":"#REF!"},{"$error":"#REF!"}]
[104,{"$error":"#REF!"},{"$error":"#REF!"},{"$error":"#REF!"},{"$error":"#REF!"},{"$error":"#REF!"},{"$error":"#REF!"},{"$error":"#REF!"},{"$error":"#REF!"},{"$error":"#REF!"},{"$f":"INDEX('PM 60-64'!$A$2:$E$107,J157+1,4)","v":{"$error":"#REF!"}},{"$error":"#REF!"},{"$error":"#REF!"},{"$error":"#REF!"},{"$error":"#REF!"},{"$error":"#REF!"}]
[105,{"$error":"#REF!"},{"$error":"#REF!"},{"$error":"#REF!"},{"$error":"#REF!"},{"$error":"#REF!"},{"$error":"#REF!"},{"$error":"#REF!"},{"$error":"#REF!"},{"$error":"#REF!"},{"$f":"INDEX('PM 60-64'!$A$2:$E$107,J158+1,4)","v":{"$error":"#REF!"}},{"$error":"#REF!"},{"$error":"#REF!"},{"$error":"#REF!"},{"$error":"#REF!"},{"$error":"#REF!"}]
[106,{"$error":"#REF!"},{"$error":"#REF!"},{"$error":"#REF!"},{"$error":"#REF!"},{"$error":"#REF!"},{"$error":"#REF!"},{"$error":"#REF!"},{"$error":"#REF!"},{"$error":"#REF!"},{"$f":"INDEX('PM 60-64'!$A$2:$E$107,J159+1,4)","v":{"$error":"#REF!"}},{"$error":"#REF!"},{"$error":"#REF!"},{"$error":"#REF!"},{"$error":"#REF!"},{"$error":"#REF!"}]
[107,{"$error":"#REF!"},{"$error":"#REF!"},{"$error":"#REF!"},{"$error":"#REF!"},{"$error":"#REF!"},{"$error":"#REF!"},{"$error":"#REF!"},{"$error":"#REF!"},{"$error":"#REF!"},{"$f":"INDEX('PM 60-64'!$A$2:$E$107,J160+1,4)","v":{"$error":"#REF!"}},{"$error":"#REF!"},{"$error":"#REF!"},{"$error":"#REF!"},{"$error":"#REF!"},{"$error":"#REF!"}]
[108,{"$error":"#REF!"},{"$error":"#REF!"},{"$error":"#REF!"},{"$error":"#REF!"},{"$error":"#REF!"},{"$error":"#REF!"},{"$error":"#REF!"},{"$error":"#REF!"},{"$error":"#REF!"},{"$f":"INDEX('PM 60-64'!$A$2:$E$107,J161+1,4)","v":{"$error":"#REF!"}},{"$error":"#REF!"},{"$error":"#REF!"},{"$error":"#REF!"},{"$error":"#REF!"},{"$error":"#REF!"}]
[109,{"$error":"#REF!"},{"$error":"#REF!"},{"$error":"#REF!"},{"$error":"#REF!"},{"$error":"#REF!"},{"$error":"#REF!"},{"$error":"#REF!"},{"$error":"#REF!"},{"$error":"#REF!"},{"$f":"INDEX('PM 60-64'!$A$2:$E$107,J162+1,4)","v":{"$error":"#REF!"}},{"$error":"#REF!"},{"$error":"#REF!"},{"$error":"#REF!"},{"$error":"#REF!"},{"$error":"#REF!"}]
[110,{"$error":"#REF!"},{"$error":"#REF!"},{"$error":"#REF!"},{"$error":"#REF!"},{"$error":"#REF!"},{"$error":"#REF!"},{"$error":"#REF!"},{"$error":"#REF!"},{"$error":"#REF!"},{"$f":"INDEX('PM 60-64'!$A$2:$E$107,J163+1,4)","v":{"$error":"#REF!"}},{"$error":"#REF!"},{"$error":"#REF!"},{"$error":"#REF!"},{"$error":"#REF!"},{"$error":"#REF!"}]
[111,{"$error":"#REF!"},{"$error":"#REF!"},{"$error":"#REF!"},{"$error":"#REF!"},{"$error":"#REF!"},{"$error":"#REF!"},{"$error":"#REF!"},{"$error":"#REF!"},{"$error":"#REF!"},{"$f":"INDEX('PM 60-64'!$A$2:$E$107,J164+1,4)","v":{"$error":"#REF!"}},{"$error":"#REF!"},{"$error":"#REF!"},{"$error":"#REF!"},{"$error":"#REF!"},{"$error":"#REF!"}]
[112,{"$error":"#REF!"},{"$error":"#REF!"},{"$error":"#REF!"},{"$error":"#REF!"},{"$error":"#REF!"},{"$error":"#REF!"},{"$error":"#REF!"},{"$error":"#REF!"},{"$error":"#REF!"},{"$f":"INDEX('PM 60-64'!$A$2:$E$107,J165+1,4)","v":{"$error":"#REF!"}},{"$error":"#REF!"},{"$error":"#REF!"},{"$error":"#REF!"},{"$error":"#REF!"},{"$error":"#REF!"}]
[113,{"$error":"#REF!"},{"$error":"#REF!"},{"$error":"#REF!"},{"$error":"#REF!"},{"$error":"#REF!"},{"$error":"#REF!"},{"$error":"#REF!"},{"$error":"#REF!"},{"$error":"#REF!"},{"$f":"INDEX('PM 60-64'!$A$2:$E$107,J166+1,4)","v":{"$error":"#REF!"}},{"$error":"#REF!"},{"$error":"#REF!"},{"$error":"#REF!"},{"$error":"#REF!"},{"$error":"#REF!"}]
[114,{"$error":"#REF!"},{"$error":"#REF!"},{"$error":"#REF!"},{"$error":"#REF!"},{"$error":"#REF!"},{"$error":"#REF!"},{"$error":"#REF!"},{"$error":"#REF!"},{"$error":"#REF!"},{"$f":"INDEX('PM 60-64'!$A$2:$E$107,J167+1,4)","v":{"$error":"#REF!"}},{"$error":"#REF!"},{"$error":"#REF!"},{"$error":"#REF!"},{"$error":"#REF!"},{"$error":"#REF!"}]
[115,{"$error":"#REF!"},{"$error":"#REF!"},{"$error":"#REF!"},{"$error":"#REF!"},{"$error":"#REF!"},{"$error":"#REF!"},{"$error":"#REF!"},{"$error":"#REF!"},{"$error":"#REF!"},{"$f":"INDEX('PM 60-64'!$A$2:$E$107,J168+1,4)","v":{"$error":"#REF!"}},{"$error":"#REF!"},{"$error":"#REF!"},{"$error":"#REF!"},{"$error":"#REF!"},{"$error":"#REF!"}]
[116,{"$error":"#REF!"},{"$error":"#REF!"},{"$error":"#REF!"},{"$error":"#REF!"},{"$error":"#REF!"},{"$error":"#REF!"},{"$error":"#REF!"},{"$error":"#REF!"},{"$error":"#REF!"},{"$f":"INDEX('PM 60-64'!$A$2:$E$107,J169+1,4)","v":{"$error":"#REF!"}},{"$error":"#REF!"},{"$error":"#REF!"},{"$error":"#REF!"},{"$error":"#REF!"},{"$error":"#REF!"}]
[117,{"$error":"#REF!"},{"$error":"#REF!"},{"$error":"#REF!"},{"$error":"#REF!"},{"$error":"#REF!"},{"$error":"#REF!"},{"$error":"#REF!"},{"$error":"#REF!"},{"$error":"#REF!"},{"$f":"INDEX('PM 60-64'!$A$2:$E$107,J170+1,4)","v":{"$error":"#REF!"}},{"$error":"#REF!"},{"$error":"#REF!"},{"$error":"#REF!"},{"$error":"#REF!"},{"$error":"#REF!"}]
[118,{"$error":"#REF!"},{"$error":"#REF!"},{"$error":"#REF!"},{"$error":"#REF!"},{"$error":"#REF!"},{"$error":"#REF!"},{"$error":"#REF!"},{"$error":"#REF!"},{"$error":"#REF!"},{"$f":"INDEX('PM 60-64'!$A$2:$E$107,J171+1,4)","v":{"$error":"#REF!"}},{"$error":"#REF!"},{"$error":"#REF!"},{"$error":"#REF!"},{"$error":"#REF!"},{"$error":"#REF!"}]
[119,{"$error":"#REF!"},{"$error":"#REF!"},{"$error":"#REF!"},{"$error":"#REF!"},{"$error":"#REF!"},{"$error":"#REF!"},{"$error":"#REF!"},{"$error":"#REF!"},{"$error":"#REF!"},{"$f":"INDEX('PM 60-64'!$A$2:$E$107,J172+1,4)","v":{"$error":"#REF!"}},{"$error":"#REF!"},{"$error":"#REF!"},{"$error":"#REF!"},{"$error":"#REF!"},{"$error":"#REF!"}]
[120,{"$error":"#REF!"},{"$error":"#REF!"},{"$error":"#REF!"},{"$error":"#REF!"},{"$error":"#REF!"},{"$error":"#REF!"},{"$error":"#REF!"},{"$error":"#REF!"},{"$error":"#REF!"},{"$f":"INDEX('PM 60-64'!$A$2:$E$107,J173+1,4)","v":{"$error":"#REF!"}},{"$f":"IF(A173>120,0,ROUND((K173*(1+$Q$7)*(1+$C$8)^(-0.5)+$Q$10)*(1+$M$9)*$Q$9,0))","v":{"$error":"#REF!"}},{"$error":"#REF!"},{"$error":"#REF!"},{"$error":"#REF!"},{"$error":"#REF!"}]
[121,{"$error":"#REF!"},{"$error":"#REF!"},{"$error":"#REF!"},{"$error":"#REF!"},{"$error":"#REF!"},{"$error":"#REF!"},{"$error":"#REF!"},{"$error":"#REF!"},{"$error":"#REF!"},{"$f":"INDEX('PM 60-64'!$A$2:$E$107,J174+1,4)","v":{"$error":"#REF!"}},0,0,{"$error":"#REF!"},{"$error":"#REF!"},{"$error":"#REF!"}]
[122,{"$error":"#REF!"},{"$error":"#REF!"},{"$error":"#REF!"},{"$error":"#REF!"},{"$error":"#REF!"},{"$error":"#REF!"},{"$error":"#REF!"},{"$error":"#REF!"},{"$error":"#REF!"},{"$f":"INDEX('PM 60-64'!$A$2:$E$107,J175+1,4)","v":{"$error":"#REF!"}},0,0,{"$error":"#REF!"},{"$error":"#REF!"},{"$error":"#REF!"}]
[123,{"$error":"#REF!"},{"$error":"#REF!"},{"$error":"#REF!"},{"$error":"#REF!"},{"$error":"#REF!"},{"$error":"#REF!"},{"$error":"#REF!"},{"$error":"#REF!"},{"$error":"#REF!"},{"$f":"INDEX('PM 60-64'!$A$2:$E$107,J176+1,4)","v":{"$error":"#REF!"}},0,0,{"$error":"#REF!"},{"$error":"#REF!"},{"$error":"#REF!"}]
[124,{"$error":"#REF!"},{"$error":"#REF!"},{"$error":"#REF!"},{"$error":"#REF!"},{"$error":"#REF!"},{"$error":"#REF!"},{"$error":"#REF!"},{"$error":"#REF!"},{"$error":"#REF!"},{"$f":"INDEX('PM 60-64'!$A$2:$E$107,J177+1,4)","v":{"$error":"#REF!"}},0,0,{"$error":"#REF!"},{"$error":"#REF!"},{"$error":"#REF!"}]
[125,{"$error":"#REF!"},{"$error":"#REF!"},{"$error":"#REF!"},{"$error":"#REF!"},{"$error":"#REF!"},{"$error":"#REF!"},{"$error":"#REF!"},{"$error":"#REF!"},{"$error":"#REF!"},{"$f":"INDEX('PM 60-64'!$A$2:$E$107,J178+1,4)","v":{"$error":"#REF!"}},0,0,{"$error":"#REF!"},{"$error":"#REF!"},{"$error":"#REF!"}]
[126,{"$error":"#REF!"},{"$error":"#REF!"},{"$error":"#REF!"},{"$error":"#REF!"},{"$error":"#REF!"},{"$error":"#REF!"},{"$error":"#REF!"},{"$error":"#REF!"},{"$error":"#REF!"},{"$f":"INDEX('PM 60-64'!$A$2:$E$107,J179+1,4)","v":{"$error":"#REF!"}},0,0,{"$error":"#REF!"},{"$error":"#REF!"},{"$error":"#REF!"}]
[127,{"$error":"#REF!"},{"$error":"#REF!"},{"$error":"#REF!"},{"$error":"#REF!"},{"$error":"#REF!"},{"$error":"#REF!"},{"$error":"#REF!"},{"$error":"#REF!"},{"$error":"#REF!"},{"$f":"INDEX('PM 60-64'!$A$2:$E$107,J180+1,4)","v":{"$error":"#REF!"}},0,0,{"$error":"#REF!"},{"$error":"#REF!"},{"$error":"#REF!"}]
[128,{"$error":"#REF!"},{"$error":"#REF!"},{"$error":"#REF!"},{"$error":"#REF!"},{"$error":"#REF!"},{"$error":"#REF!"},{"$error":"#REF!"},{"$error":"#REF!"},{"$error":"#REF!"},{"$f":"INDEX('PM 60-64'!$A$2:$E$107,J181+1,4)","v":{"$error":"#REF!"}},0,0,{"$error":"#REF!"},{"$error":"#REF!"},{"$error":"#REF!"}]
[129,{"$error":"#REF!"},{"$error":"#REF!"},{"$f":"$I$9","v":{"$error":"#REF!"}},{"$error":"#REF!"},{"$error":"#REF!"},{"$error":"#REF!"},{"$error":"#REF!"},{"$f":"ROUND(D182-F182-G182-H182,1)","v":{"$error":"#REF!"}},{"$error":"#REF!"},{"$f":"INDEX('PM 60-64'!$A$2:$E$107,J182+1,4)","v":{"$error":"#REF!"}},0,0,{"$f":"I182+M182","v":{"$error":"#REF!"}},{"$error":"#REF!"},{"$error":"#REF!"}]
[130,{"$error":"#REF!"},{"$f":"B183","v":{"$error":"#REF!"}},{"$error":"#REF!"},{"$error":"#REF!"},{"$f":"IF($I$8=\"O\",IF(12*(YEAR(C183)-YEAR($J$3))+MONTH(C183)-MONTH($J$3)+1>12,0,D183*$I$6*MIN($I$7,$O$3)),D183*$I$6)","v":{"$error":"#REF!"}},{"$f":"IF($M$10=\"Ppure\",ROUND((D183-F183)*$M$6/(1+$M$6+$M$7),0),ROUND(D183*$M$6,0))","v":{"$error":"#REF!"}},{"$f":"IF($M$10=\"Ppure\",ROUND((D183-F183)*$M$7/(1+$M$6+$M$7),0),ROUND(D183*$M$7,0))","v":{"$error":"#REF!"}},{"$error":"#REF!"},{"$f":"INT(YEAR(C183)-YEAR($Q$6)+$O$4+0*(MONTH(C183)-MONTH($Q$6))/12)","v":{"$error":"#REF!"}},{"$f":"INDEX('PM 60-64'!$A$2:$E$107,J183+1,4)","v":{"$error":"#REF!"}},{"$f":"IF(A183>120,0,ROUND((K183*(1+$Q$7)*(1+$C$8)^(-0.5)+$Q$10)*(1+$M$9)*$Q$9,0))","v":0},{"$f":"ROUND(-L183/12,0)","v":0},{"$error":"#REF!"},{"$error":"#REF!"},{"$f":"(O183+N183)*(1+$C$10)","v":{"$error":"#REF!"}}]
[131,{"$f":"DATE(YEAR(B183),MONTH(B183)+1,DAY(B183))","v":{"$error":"#REF!"}},{"$error":"#REF!"},{"$error":"#REF!"},{"$f":"E183+D183","v":{"$error":"#REF!"}},{"$error":"#REF!"},{"$error":"#REF!"},{"$error":"#REF!"},{"$error":"#REF!"},{"$error":"#REF!"},{"$f":"INDEX('PM 60-64'!$A$2:$E$107,J184+1,4)","v":{"$error":"#REF!"}},0,0,{"$error":"#REF!"},{"$f":"P183","v":{"$error":"#REF!"}},{"$error":"#REF!"}]
[132,{"$error":"#REF!"},{"$error":"#REF!"},{"$error":"#REF!"},{"$error":"#REF!"},{"$error":"#REF!"},{"$error":"#REF!"},{"$error":"#REF!"},{"$error":"#REF!"},{"$error":"#REF!"},{"$f":"INDEX('PM 60-64'!$A$2:$E$107,J185+1,4)","v":{"$error":"#REF!"}},0,0,{"$error":"#REF!"},{"$error":"#REF!"},{"$error":"#REF!"}]
[133,{"$error":"#REF!"},{"$error":"#REF!"},{"$error":"#REF!"},{"$error":"#REF!"},{"$error":"#REF!"},{"$error":"#REF!"},{"$error":"#REF!"},{"$error":"#REF!"},{"$error":"#REF!"},{"$f":"INDEX('PM 60-64'!$A$2:$E$107,J186+1,4)","v":{"$error":"#REF!"}},0,0,{"$error":"#REF!"},{"$error":"#REF!"},{"$error":"#REF!"}]
[134,{"$error":"#REF!"},{"$error":"#REF!"},{"$error":"#REF!"},{"$error":"#REF!"},{"$error":"#REF!"},{"$error":"#REF!"},{"$error":"#REF!"},{"$error":"#REF!"},{"$error":"#REF!"},{"$f":"INDEX('PM 60-64'!$A$2:$E$107,J187+1,4)","v":{"$error":"#REF!"}},0,0,{"$error":"#REF!"},{"$error":"#REF!"},{"$error":"#REF!"}]
[135,{"$error":"#REF!"},{"$error":"#REF!"},{"$error":"#REF!"},{"$error":"#REF!"},{"$error":"#REF!"},{"$error":"#REF!"},{"$error":"#REF!"},{"$error":"#REF!"},{"$error":"#REF!"},{"$f":"INDEX('PM 60-64'!$A$2:$E$107,J188+1,4)","v":{"$error":"#REF!"}},0,0,{"$error":"#REF!"},{"$error":"#REF!"},{"$error":"#REF!"}]
[136,{"$error":"#REF!"},{"$error":"#REF!"},{"$error":"#REF!"},{"$error":"#REF!"},{"$error":"#REF!"},{"$error":"#REF!"},{"$error":"#REF!"},{"$error":"#REF!"},{"$error":"#REF!"},{"$f":"INDEX('PM 60-64'!$A$2:$E$107,J189+1,4)","v":{"$error":"#REF!"}},0,0,{"$error":"#REF!"},{"$error":"#REF!"},{"$error":"#REF!"}]
[137,{"$error":"#REF!"},{"$error":"#REF!"},{"$error":"#REF!"},{"$error":"#REF!"},{"$error":"#REF!"},{"$error":"#REF!"},{"$error":"#REF!"},{"$error":"#REF!"},{"$error":"#REF!"},{"$f":"INDEX('PM 60-64'!$A$2:$E$107,J190+1,4)","v":{"$error":"#REF!"}},0,0,{"$error":"#REF!"},{"$error":"#REF!"},{"$error":"#REF!"}]
[138,{"$error":"#REF!"},{"$error":"#REF!"},{"$error":"#REF!"},{"$error":"#REF!"},{"$error":"#REF!"},{"$error":"#REF!"},{"$error":"#REF!"},{"$error":"#REF!"},{"$error":"#REF!"},{"$f":"INDEX('PM 60-64'!$A$2:$E$107,J191+1,4)","v":{"$error":"#REF!"}},0,0,{"$error":"#REF!"},{"$error":"#REF!"},{"$error":"#REF!"}]
[139,{"$error":"#REF!"},{"$error":"#REF!"},{"$error":"#REF!"},{"$error":"#REF!"},{"$error":"#REF!"},{"$error":"#REF!"},{"$error":"#REF!"},{"$error":"#REF!"},{"$error":"#REF!"},{"$f":"INDEX('PM 60-64'!$A$2:$E$107,J192+1,4)","v":{"$error":"#REF!"}},0,0,{"$error":"#REF!"},{"$error":"#REF!"},{"$error":"#REF!"}]
[140,{"$error":"#REF!"},{"$error":"#REF!"},{"$error":"#REF!"},{"$error":"#REF!"},{"$error":"#REF!"},{"$error":"#REF!"},{"$error":"#REF!"},{"$error":"#REF!"},{"$error":"#REF!"},{"$f":"INDEX('PM 60-64'!$A$2:$E$107,J193+1,4)","v":{"$error":"#REF!"}},0,0,{"$error":"#REF!"},{"$error":"#REF!"},{"$error":"#REF!"}]
[141,{"$error":"#REF!"},{"$error":"#REF!"},{"$error":"#REF!"},{"$error":"#REF!"},{"$error":"#REF!"},{"$error":"#REF!"},{"$error":"#REF!"},{"$error":"#REF!"},{"$error":"#REF!"},{"$f":"INDEX('PM 60-64'!$A$2:$E$107,J194+1,4)","v":{"$error":"#REF!"}},0,0,{"$error":"#REF!"},{"$error":"#REF!"},{"$error":"#REF!"}]
[142,{"$error":"#REF!"},{"$error":"#REF!"},{"$error":"#REF!"},{"$error":"#REF!"},{"$error":"#REF!"},{"$error":"#REF!"},{"$error":"#REF!"},{"$error":"#REF!"},{"$error":"#REF!"},{"$f":"INDEX('PM 60-64'!$A$2:$E$107,J195+1,4)","v":{"$error":"#REF!"}},0,0,{"$error":"#REF!"},{"$error":"#REF!"},{"$error":"#REF!"}]
[143,{"$error":"#REF!"},{"$error":"#REF!"},{"$error":"#REF!"},{"$error":"#REF!"},{"$error":"#REF!"},{"$error":"#REF!"},{"$error":"#REF!"},{"$error":"#REF!"},{"$error":"#REF!"},{"$f":"INDEX('PM 60-64'!$A$2:$E$107,J196+1,4)","v":{"$error":"#REF!"}},0,0,{"$error":"#REF!"},{"$error":"#REF!"},{"$error":"#REF!"}]
[144,{"$error":"#REF!"},{"$error":"#REF!"},{"$error":"#REF!"},{"$error":"#REF!"},{"$error":"#REF!"},{"$error":"#REF!"},{"$error":"#REF!"},{"$error":"#REF!"},{"$error":"#REF!"},{"$f":"INDEX('PM 60-64'!$A$2:$E$107,J197+1,4)","v":{"$error":"#REF!"}},0,0,{"$error":"#REF!"},{"$error":"#REF!"},{"$error":"#REF!"}]
[145,{"$error":"#REF!"},{"$error":"#REF!"},{"$error":"#REF!"},{"$error":"#REF!"},{"$error":"#REF!"},{"$error":"#REF!"},{"$error":"#REF!"},{"$error":"#REF!"},{"$error":"#REF!"},{"$f":"INDEX('PM 60-64'!$A$2:$E$107,J198+1,4)","v":{"$error":"#REF!"}},0,0,{"$error":"#REF!"},{"$error":"#REF!"},{"$error":"#REF!"}]
[146,{"$error":"#REF!"},{"$error":"#REF!"},{"$error":"#REF!"},{"$error":"#REF!"},{"$error":"#REF!"},{"$error":"#REF!"},{"$error":"#REF!"},{"$error":"#REF!"},{"$error":"#REF!"},{"$f":"INDEX('PM 60-64'!$A$2:$E$107,J199+1,4)","v":{"$error":"#REF!"}},0,0,{"$error":"#REF!"},{"$error":"#REF!"},{"$error":"#REF!"}]
[147,{"$error":"#REF!"},{"$error":"#REF!"},{"$error":"#REF!"},{"$error":"#REF!"},{"$error":"#REF!"},{"$error":"#REF!"},{"$error":"#REF!"},{"$error":"#REF!"},{"$error":"#REF!"},{"$f":"INDEX('PM 60-64'!$A$2:$E$107,J200+1,4)","v":{"$error":"#REF!"}},0,0,{"$error":"#REF!"},{"$error":"#REF!"},{"$error":"#REF!"}]
[148,{"$error":"#REF!"},{"$error":"#REF!"},{"$error":"#REF!"},{"$error":"#REF!"},{"$error":"#REF!"},{"$error":"#REF!"},{"$error":"#REF!"},{"$error":"#REF!"},{"$error":"#REF!"},{"$f":"INDEX('PM 60-64'!$A$2:$E$107,J201+1,4)","v":{"$error":"#REF!"}},0,0,{"$error":"#REF!"},{"$error":"#REF!"},{"$error":"#REF!"}]
[149,{"$error":"#REF!"},{"$error":"#REF!"},{"$error":"#REF!"},{"$error":"#REF!"},{"$error":"#REF!"},{"$error":"#REF!"},{"$error":"#REF!"},{"$error":"#REF!"},{"$error":"#REF!"},{"$f":"INDEX('PM 60-64'!$A$2:$E$107,J202+1,4)","v":{"$error":"#REF!"}},0,0,{"$error":"#REF!"},{"$error":"#REF!"},{"$error":"#REF!"}]
[150,{"$error":"#REF!"},{"$error":"#REF!"},{"$error":"#REF!"},{"$error":"#REF!"},{"$error":"#REF!"},{"$error":"#REF!"},{"$error":"#REF!"},{"$error":"#REF!"},{"$error":"#REF!"},{"$f":"INDEX('PM 60-64'!$A$2:$E$107,J203+1,4)","v":{"$error":"#REF!"}},0,0,{"$error":"#REF!"},{"$error":"#REF!"},{"$error":"#REF!"}]
[151,{"$error":"#REF!"},{"$error":"#REF!"},{"$error":"#REF!"},{"$error":"#REF!"},{"$error":"#REF!"},{"$error":"#REF!"},{"$error":"#REF!"},{"$error":"#REF!"},{"$error":"#REF!"},{"$f":"INDEX('PM 60-64'!$A$2:$E$107,J204+1,4)","v":{"$error":"#REF!"}},0,0,{"$error":"#REF!"},{"$error":"#REF!"},{"$error":"#REF!"}]
[152,{"$error":"#REF!"},{"$error":"#REF!"},{"$error":"#REF!"},{"$error":"#REF!"},{"$error":"#REF!"},{"$error":"#REF!"},{"$error":"#REF!"},{"$error":"#REF!"},{"$error":"#REF!"},{"$f":"INDEX('PM 60-64'!$A$2:$E$107,J205+1,4)","v":{"$error":"#REF!"}},0,0,{"$error":"#REF!"},{"$error":"#REF!"},{"$error":"#REF!"}]
[153,{"$error":"#REF!"},{"$error":"#REF!"},{"$error":"#REF!"},{"$error":"#REF!"},{"$error":"#REF!"},{"$error":"#REF!"},{"$error":"#REF!"},{"$error":"#REF!"},{"$error":"#REF!"},{"$f":"INDEX('PM 60-64'!$A$2:$E$107,J206+1,4)","v":{"$error":"#REF!"}},0,0,{"$error":"#REF!"},{"$error":"#REF!"},{"$error":"#REF!"}]
[154,{"$error":"#REF!"},{"$error":"#REF!"},{"$error":"#REF!"},{"$error":"#REF!"},{"$error":"#REF!"},{"$error":"#REF!"},{"$error":"#REF!"},{"$error":"#REF!"},{"$error":"#REF!"},{"$f":"INDEX('PM 60-64'!$A$2:$E$107,J207+1,4)","v":{"$error":"#REF!"}},0,0,{"$error":"#REF!"},{"$error":"#REF!"},{"$error":"#REF!"}]
[155,{"$error":"#REF!"},{"$error":"#REF!"},{"$error":"#REF!"},{"$error":"#REF!"},{"$error":"#REF!"},{"$error":"#REF!"},{"$error":"#REF!"},{"$error":"#REF!"},{"$error":"#REF!"},{"$f":"INDEX('PM 60-64'!$A$2:$E$107,J208+1,4)","v":{"$error":"#REF!"}},0,0,{"$error":"#REF!"},{"$error":"#REF!"},{"$error":"#REF!"}]
[156,{"$error":"#REF!"},{"$error":"#REF!"},{"$error":"#REF!"},{"$error":"#REF!"},{"$error":"#REF!"},{"$error":"#REF!"},{"$error":"#REF!"},{"$error":"#REF!"},{"$error":"#REF!"},{"$f":"INDEX('PM 60-64'!$A$2:$E$107,J209+1,4)","v":{"$error":"#REF!"}},0,0,{"$error":"#REF!"},{"$error":"#REF!"},{"$error":"#REF!"}]
[157,{"$error":"#REF!"},{"$error":"#REF!"},{"$error":"#REF!"},{"$error":"#REF!"},{"$error":"#REF!"},{"$error":"#REF!"},{"$error":"#REF!"},{"$error":"#REF!"},{"$error":"#REF!"},{"$f":"INDEX('PM 60-64'!$A$2:$E$107,J210+1,4)","v":{"$error":"#REF!"}},0,0,{"$error":"#REF!"},{"$error":"#REF!"},{"$error":"#REF!"}]
[158,{"$error":"#REF!"},{"$error":"#REF!"},{"$error":"#REF!"},{"$error":"#REF!"},{"$error":"#REF!"},{"$error":"#REF!"},{"$error":"#REF!"},{"$error":"#REF!"},{"$error":"#REF!"},{"$f":"INDEX('PM 60-64'!$A$2:$E$107,J211+1,4)","v":{"$error":"#REF!"}},0,0,{"$error":"#REF!"},{"$error":"#REF!"},{"$error":"#REF!"}]
[159,{"$error":"#REF!"},{"$error":"#REF!"},{"$error":"#REF!"},{"$error":"#REF!"},{"$error":"#REF!"},{"$error":"#REF!"},{"$error":"#REF!"},{"$error":"#REF!"},{"$error":"#REF!"},{"$f":"INDEX('PM 60-64'!$A$2:$E$107,J212+1,4)","v":{"$error":"#REF!"}},0,0,{"$error":"#REF!"},{"$error":"#REF!"},{"$error":"#REF!"}]
[160,{"$error":"#REF!"},{"$error":"#REF!"},{"$error":"#REF!"},{"$error":"#REF!"},{"$error":"#REF!"},{"$error":"#REF!"},{"$error":"#REF!"},{"$error":"#REF!"},{"$error":"#REF!"},{"$f":"INDEX('PM 60-64'!$A$2:$E$107,J213+1,4)","v":{"$error":"#REF!"}},0,0,{"$error":"#REF!"},{"$error":"#REF!"},{"$error":"#REF!"}]
[161,{"$error":"#REF!"},{"$error":"#REF!"},{"$error":"#REF!"},{"$error":"#REF!"},{"$error":"#REF!"},{"$error":"#REF!"},{"$error":"#REF!"},{"$error":"#REF!"},{"$error":"#REF!"},{"$f":"INDEX('PM 60-64'!$A$2:$E$107,J214+1,4)","v":{"$error":"#REF!"}},0,0,{"$error":"#REF!"},{"$error":"#REF!"},{"$error":"#REF!"}]
[162,{"$error":"#REF!"},{"$error":"#REF!"},{"$error":"#REF!"},{"$error":"#REF!"},{"$error":"#REF!"},{"$error":"#REF!"},{"$error":"#REF!"},{"$error":"#REF!"},{"$error":"#REF!"},{"$f":"INDEX('PM 60-64'!$A$2:$E$107,J215+1,4)","v":{"$error":"#REF!"}},0,0,{"$error":"#REF!"},{"$error":"#REF!"},{"$error":"#REF!"}]
[163,{"$error":"#REF!"},{"$error":"#REF!"},{"$error":"#REF!"},{"$error":"#REF!"},{"$error":"#REF!"},{"$error":"#REF!"},{"$error":"#REF!"},{"$error":"#REF!"},{"$error":"#REF!"},{"$f":"INDEX('PM 60-64'!$A$2:$E$107,J216+1,4)","v":{"$error":"#REF!"}},0,0,{"$error":"#REF!"},{"$error":"#REF!"},{"$error":"#REF!"}]
[164,{"$error":"#REF!"},{"$error":"#REF!"},{"$error":"#REF!"},{"$error":"#REF!"},{"$error":"#REF!"},{"$error":"#REF!"},{"$error":"#REF!"},{"$error":"#REF!"},{"$error":"#REF!"},{"$f":"INDEX('PM 60-64'!$A$2:$E$107,J217+1,4)","v":{"$error":"#REF!"}},0,0,{"$error":"#REF!"},{"$error":"#REF!"},{"$error":"#REF!"}]
[165,{"$error":"#REF!"},{"$error":"#REF!"},{"$error":"#REF!"},{"$error":"#REF!"},{"$error":"#REF!"},{"$error":"#REF!"},{"$error":"#REF!"},{"$error":"#REF!"},{"$error":"#REF!"},{"$f":"INDEX('PM 60-64'!$A$2:$E$107,J218+1,4)","v":{"$error":"#REF!"}},0,0,{"$error":"#REF!"},{"$error":"#REF!"},{"$error":"#REF!"}]
[166,{"$error":"#REF!"},{"$error":"#REF!"},{"$error":"#REF!"},{"$error":"#REF!"},{"$error":"#REF!"},{"$error":"#REF!"},{"$error":"#REF!"},{"$error":"#REF!"},{"$error":"#REF!"},{"$f":"INDEX('PM 60-64'!$A$2:$E$107,J219+1,4)","v":{"$error":"#REF!"}},0,0,{"$error":"#REF!"},{"$error":"#REF!"},{"$error":"#REF!"}]
[167,{"$error":"#REF!"},{"$error":"#REF!"},{"$error":"#REF!"},{"$error":"#REF!"},{"$error":"#REF!"},{"$error":"#REF!"},{"$error":"#REF!"},{"$error":"#REF!"},{"$error":"#REF!"},{"$f":"INDEX('PM 60-64'!$A$2:$E$107,J220+1,4)","v":{"$error":"#REF!"}},0,0,{"$error":"#REF!"},{"$error":"#REF!"},{"$error":"#REF!"}]
[168,{"$error":"#REF!"},{"$error":"#REF!"},{"$error":"#REF!"},{"$error":"#REF!"},{"$error":"#REF!"},{"$error":"#REF!"},{"$error":"#REF!"},{"$error":"#REF!"},{"$error":"#REF!"},{"$f":"INDEX('PM 60-64'!$A$2:$E$107,J221+1,4)","v":{"$error":"#REF!"}},0,0,{"$error":"#REF!"},{"$error":"#REF!"},{"$error":"#REF!"}]
[169,{"$error":"#REF!"},{"$error":"#REF!"},{"$error":"#REF!"},{"$error":"#REF!"},{"$error":"#REF!"},{"$error":"#REF!"},{"$error":"#REF!"},{"$error":"#REF!"},{"$error":"#REF!"},{"$f":"INDEX('PM 60-64'!$A$2:$E$107,J222+1,4)","v":{"$error":"#REF!"}},0,0,{"$error":"#REF!"},{"$error":"#REF!"},{"$error":"#REF!"}]
[170,{"$error":"#REF!"},{"$error":"#REF!"},{"$error":"#REF!"},{"$error":"#REF!"},{"$error":"#REF!"},{"$error":"#REF!"},{"$error":"#REF!"},{"$error":"#REF!"},{"$error":"#REF!"},{"$f":"INDEX('PM 60-64'!$A$2:$E$107,J223+1,4)","v":{"$error":"#REF!"}},0,0,{"$error":"#REF!"},{"$error":"#REF!"},{"$error":"#REF!"}]
[171,{"$error":"#REF!"},{"$error":"#REF!"},{"$error":"#REF!"},{"$error":"#REF!"},{"$error":"#REF!"},{"$error":"#REF!"},{"$error":"#REF!"},{"$error":"#REF!"},{"$error":"#REF!"},{"$f":"INDEX('PM 60-64'!$A$2:$E$107,J224+1,4)","v":{"$error":"#REF!"}},0,0,{"$error":"#REF!"},{"$error":"#REF!"},{"$error":"#REF!"}]
[172,{"$error":"#REF!"},{"$error":"#REF!"},{"$error":"#REF!"},{"$error":"#REF!"},{"$error":"#REF!"},{"$error":"#REF!"},{"$error":"#REF!"},{"$error":"#REF!"},{"$error":"#REF!"},{"$f":"INDEX('PM 60-64'!$A$2:$E$107,J225+1,4)","v":{"$error":"#REF!"}},0,0,{"$error":"#REF!"},{"$error":"#REF!"},{"$error":"#REF!"}]
[173,{"$error":"#REF!"},{"$error":"#REF!"},{"$error":"#REF!"},{"$error":"#REF!"},{"$error":"#REF!"},{"$error":"#REF!"},{"$error":"#REF!"},{"$error":"#REF!"},{"$error":"#REF!"},{"$f":"INDEX('PM 60-64'!$A$2:$E$107,J226+1,4)","v":{"$error":"#REF!"}},0,0,{"$error":"#REF!"},{"$error":"#REF!"},{"$error":"#REF!"}]
[174,{"$error":"#REF!"},{"$error":"#REF!"},{"$error":"#REF!"},{"$error":"#REF!"},{"$error":"#REF!"},{"$error":"#REF!"},{"$error":"#REF!"},{"$error":"#REF!"},{"$error":"#REF!"},{"$f":"INDEX('PM 60-64'!$A$2:$E$107,J227+1,4)","v":{"$error":"#REF!"}},0,0,{"$error":"#REF!"},{"$error":"#REF!"},{"$error":"#REF!"}]
[175,{"$error":"#REF!"},{"$error":"#REF!"},{"$error":"#REF!"},{"$error":"#REF!"},{"$error":"#REF!"},{"$error":"#REF!"},{"$error":"#REF!"},{"$error":"#REF!"},{"$error":"#REF!"},{"$f":"INDEX('PM 60-64'!$A$2:$E$107,J228+1,4)","v":{"$error":"#REF!"}},0,0,{"$error":"#REF!"},{"$error":"#REF!"},{"$error":"#REF!"}]
[176,{"$error":"#REF!"},{"$error":"#REF!"},{"$error":"#REF!"},{"$error":"#REF!"},{"$error":"#REF!"},{"$error":"#REF!"},{"$error":"#REF!"},{"$error":"#REF!"},{"$error":"#REF!"},{"$f":"INDEX('PM 60-64'!$A$2:$E$107,J229+1,4)","v":{"$error":"#REF!"}},0,0,{"$error":"#REF!"},{"$error":"#REF!"},{"$error":"#REF!"}]
[177,{"$error":"#REF!"},{"$error":"#REF!"},{"$error":"#REF!"},{"$error":"#REF!"},{"$error":"#REF!"},{"$error":"#REF!"},{"$error":"#REF!"},{"$error":"#REF!"},{"$error":"#REF!"},{"$f":"INDEX('PM 60-64'!$A$2:$E$107,J230+1,4)","v":{"$error":"#REF!"}},0,0,{"$error":"#REF!"},{"$error":"#REF!"},{"$error":"#REF!"}]
[178,{"$error":"#REF!"},{"$error":"#REF!"},{"$error":"#REF!"},{"$error":"#REF!"},{"$error":"#REF!"},{"$error":"#REF!"},{"$error":"#REF!"},{"$error":"#REF!"},{"$error":"#REF!"},{"$f":"INDEX('PM 60-64'!$A$2:$E$107,J231+1,4)","v":{"$error":"#REF!"}},0,0,{"$error":"#REF!"},{"$error":"#REF!"},{"$error":"#REF!"}]
[179,{"$error":"#REF!"},{"$error":"#REF!"},{"$error":"#REF!"},{"$error":"#REF!"},{"$error":"#REF!"},{"$error":"#REF!"},{"$error":"#REF!"},{"$error":"#REF!"},{"$error":"#REF!"},{"$f":"INDEX('PM 60-64'!$A$2:$E$107,J232+1,4)","v":{"$error":"#REF!"}},0,0,{"$error":"#REF!"},{"$error":"#REF!"},{"$error":"#REF!"}]
[180,{"$error":"#REF!"},{"$error":"#REF!"},{"$error":"#REF!"},{"$error":"#REF!"},{"$error":"#REF!"},{"$error":"#REF!"},{"$error":"#REF!"},{"$error":"#REF!"},{"$error":"#REF!"},{"$f":"INDEX('PM 60-64'!$A$2:$E$107,J233+1,4)","v":{"$error":"#REF!"}},0,0,{"$error":"#REF!"},{"$error":"#REF!"},{"$error":"#REF!"}]
[181,{"$error":"#REF!"},{"$error":"#REF!"},{"$error":"#REF!"},{"$error":"#REF!"},{"$error":"#REF!"},{"$error":"#REF!"},{"$error":"#REF!"},{"$error":"#REF!"},{"$error":"#REF!"},{"$f":"INDEX('PM 60-64'!$A$2:$E$107,J234+1,4)","v":{"$error":"#REF!"}},0,0,{"$error":"#REF!"},{"$error":"#REF!"},{"$error":"#REF!"}]
[182,{"$error":"#REF!"},{"$error":"#REF!"},{"$error":"#REF!"},{"$error":"#REF!"},{"$error":"#REF!"},{"$error":"#REF!"},{"$error":"#REF!"},{"$error":"#REF!"},{"$error":"#REF!"},{"$f":"INDEX('PM 60-64'!$A$2:$E$107,J235+1,4)","v":{"$error":"#REF!"}},0,0,{"$error":"#REF!"},{"$error":"#REF!"},{"$error":"#REF!"}]
[183,{"$error":"#REF!"},{"$error":"#REF!"},{"$error":"#REF!"},{"$error":"#REF!"},{"$error":"#REF!"},{"$error":"#REF!"},{"$error":"#REF!"},{"$error":"#REF!"},{"$error":"#REF!"},{"$f":"INDEX('PM 60-64'!$A$2:$E$107,J236+1,4)","v":{"$error":"#REF!"}},0,0,{"$error":"#REF!"},{"$error":"#REF!"},{"$error":"#REF!"}]
[184,{"$error":"#REF!"},{"$error":"#REF!"},{"$error":"#REF!"},{"$error":"#REF!"},{"$error":"#REF!"},{"$error":"#REF!"},{"$error":"#REF!"},{"$error":"#REF!"},{"$error":"#REF!"},{"$f":"INDEX('PM 60-64'!$A$2:$E$107,J237+1,4)","v":{"$error":"#REF!"}},0,0,{"$error":"#REF!"},{"$error":"#REF!"},{"$error":"#REF!"}]
[185,{"$error":"#REF!"},{"$error":"#REF!"},{"$error":"#REF!"},{"$error":"#REF!"},{"$error":"#REF!"},{"$error":"#REF!"},{"$error":"#REF!"},{"$error":"#REF!"},{"$error":"#REF!"},{"$f":"INDEX('PM 60-64'!$A$2:$E$107,J238+1,4)","v":{"$error":"#REF!"}},0,0,{"$error":"#REF!"},{"$error":"#REF!"},{"$error":"#REF!"}]
[186,{"$error":"#REF!"},{"$error":"#REF!"},{"$error":"#REF!"},{"$error":"#REF!"},{"$error":"#REF!"},{"$error":"#REF!"},{"$error":"#REF!"},{"$error":"#REF!"},{"$error":"#REF!"},{"$f":"INDEX('PM 60-64'!$A$2:$E$107,J239+1,4)","v":{"$error":"#REF!"}},0,0,{"$error":"#REF!"},{"$error":"#REF!"},{"$error":"#REF!"}]
[187,{"$error":"#REF!"},{"$error":"#REF!"},{"$error":"#REF!"},{"$error":"#REF!"},{"$error":"#REF!"},{"$error":"#REF!"},{"$error":"#REF!"},{"$error":"#REF!"},{"$error":"#REF!"},{"$f":"INDEX('PM 60-64'!$A$2:$E$107,J240+1,4)","v":{"$error":"#REF!"}},0,0,{"$error":"#REF!"},{"$error":"#REF!"},{"$error":"#REF!"}]
[188,{"$error":"#REF!"},{"$error":"#REF!"},{"$error":"#REF!"},{"$error":"#REF!"},{"$error":"#REF!"},{"$error":"#REF!"},{"$error":"#REF!"},{"$error":"#REF!"},{"$error":"#REF!"},{"$f":"INDEX('PM 60-64'!$A$2:$E$107,J241+1,4)","v":{"$error":"#REF!"}},0,0,{"$error":"#REF!"},{"$error":"#REF!"},{"$error":"#REF!"}]
[189,{"$error":"#REF!"},{"$error":"#REF!"},{"$error":"#REF!"},{"$error":"#REF!"},{"$error":"#REF!"},{"$error":"#REF!"},{"$error":"#REF!"},{"$error":"#REF!"},{"$error":"#REF!"},{"$f":"INDEX('PM 60-64'!$A$2:$E$107,J242+1,4)","v":{"$error":"#REF!"}},0,0,{"$error":"#REF!"},{"$error":"#REF!"},{"$error":"#REF!"}]
[190,{"$error":"#REF!"},{"$error":"#REF!"},{"$error":"#REF!"},{"$error":"#REF!"},{"$error":"#REF!"},{"$error":"#REF!"},{"$error":"#REF!"},{"$error":"#REF!"},{"$error":"#REF!"},{"$f":"INDEX('PM 60-64'!$A$2:$E$107,J243+1,4)","v":{"$error":"#REF!"}},0,0,{"$error":"#REF!"},{"$error":"#REF!"},{"$error":"#REF!"}]
[191,{"$error":"#REF!"},{"$error":"#REF!"},{"$error":"#REF!"},{"$error":"#REF!"},{"$error":"#REF!"},{"$error":"#REF!"},{"$error":"#REF!"},{"$error":"#REF!"},{"$error":"#REF!"},{"$f":"INDEX('PM 60-64'!$A$2:$E$107,J244+1,4)","v":{"$error":"#REF!"}},0,0,{"$error":"#REF!"},{"$error":"#REF!"},{"$error":"#REF!"}]
[192,{"$error":"#REF!"},{"$error":"#REF!"},{"$error":"#REF!"},{"$error":"#REF!"},{"$error":"#REF!"},{"$error":"#REF!"},{"$error":"#REF!"},{"$error":"#REF!"},{"$error":"#REF!"},{"$f":"INDEX('PM 60-64'!$A$2:$E$107,J245+1,4)","v":{"$error":"#REF!"}},0,0,{"$error":"#REF!"},{"$error":"#REF!"},{"$error":"#REF!"}]
[193,{"$error":"#REF!"},{"$error":"#REF!"},{"$f":"$I$9","v":{"$error":"#REF!"}},{"$error":"#REF!"},{"$error":"#REF!"},{"$error":"#REF!"},{"$error":"#REF!"},{"$f":"ROUND(D246-F246-G246-H246,1)","v":{"$error":"#REF!"}},{"$error":"#REF!"},{"$f":"INDEX('PM 60-64'!$A$2:$E$107,J246+1,4)","v":{"$error":"#REF!"}},0,0,{"$f":"I246+M246","v":{"$error":"#REF!"}},{"$error":"#REF!"},{"$error":"#REF!"}]
[194,{"$error":"#REF!"},{"$f":"B247","v":{"$error":"#REF!"}},{"$error":"#REF!"},{"$error":"#REF!"},{"$f":"IF($I$8=\"O\",IF(12*(YEAR(C247)-YEAR($J$3))+MONTH(C247)-MONTH($J$3)+1>12,0,D247*$I$6*MIN($I$7,$O$3)),D247*$I$6)","v":{"$error":"#REF!"}},{"$f":"IF($M$10=\"Ppure\",ROUND((D247-F247)*$M$6/(1+$M$6+$M$7),0),ROUND(D247*$M$6,0))","v":{"$error":"#REF!"}},{"$f":"IF($M$10=\"Ppure\",ROUND((D247-F247)*$M$7/(1+$M$6+$M$7),0),ROUND(D247*$M$7,0))","v":{"$error":"#REF!"}},{"$error":"#REF!"},{"$f":"INT(YEAR(C247)-YEAR($Q$6)+$O$4+0*(MONTH(C247)-MONTH($Q$6))/12)","v":{"$error":"#REF!"}},{"$f":"INDEX('PM 60-64'!$A$2:$E$107,J247+1,4)","v":{"$error":"#REF!"}},{"$f":"IF(A247>120,0,ROUND((K247*(1+$Q$7)*(1+$C$8)^(-0.5)+$Q$10)*(1+$M$9)*$Q$9,0))","v":0},{"$f":"ROUND(-L247/12,0)","v":0},{"$error":"#REF!"},{"$error":"#REF!"},{"$f":"(O247+N247)*(1+$C$10)","v":{"$error":"#REF!"}}]
[195,{"$f":"DATE(YEAR(B247),MONTH(B247)+1,DAY(B247))","v":{"$error":"#REF!"}},{"$error":"#REF!"},{"$error":"#REF!"},{"$f":"E247+D247","v":{"$error":"#REF!"}},{"$error":"#REF!"},{"$error":"#REF!"},{"$error":"#REF!"},{"$error":"#REF!"},{"$error":"#REF!"},{"$f":"INDEX('PM 60-64'!$A$2:$E$107,J248+1,4)","v":{"$error":"#REF!"}},0,0,{"$error":"#REF!"},{"$f":"P247","v":{"$error":"#REF!"}},{"$error":"#REF!"}]
[196,{"$error":"#REF!"},{"$error":"#REF!"},{"$error":"#REF!"},{"$error":"#REF!"},{"$error":"#REF!"},{"$error":"#REF!"},{"$error":"#REF!"},{"$error":"#REF!"},{"$error":"#REF!"},{"$f":"INDEX('PM 60-64'!$A$2:$E$107,J249+1,4)","v":{"$error":"#REF!"}},0,0,{"$error":"#REF!"},{"$error":"#REF!"},{"$error":"#REF!"}]
[197,{"$error":"#REF!"},{"$error":"#REF!"},{"$error":"#REF!"},{"$error":"#REF!"},{"$error":"#REF!"},{"$error":"#REF!"},{"$error":"#REF!"},{"$error":"#REF!"},{"$error":"#REF!"},{"$f":"INDEX('PM 60-64'!$A$2:$E$107,J250+1,4)","v":{"$error":"#REF!"}},0,0,{"$error":"#REF!"},{"$error":"#REF!"},{"$error":"#REF!"}]
[198,{"$error":"#REF!"},{"$error":"#REF!"},{"$error":"#REF!"},{"$error":"#REF!"},{"$error":"#REF!"},{"$error":"#REF!"},{"$error":"#REF!"},{"$error":"#REF!"},{"$error":"#REF!"},{"$f":"INDEX('PM 60-64'!$A$2:$E$107,J251+1,4)","v":{"$error":"#REF!"}},0,0,{"$error":"#REF!"},{"$error":"#REF!"},{"$error":"#REF!"}]
[199,{"$error":"#REF!"},{"$error":"#REF!"},{"$error":"#REF!"},{"$error":"#REF!"},{"$error":"#REF!"},{"$error":"#REF!"},{"$error":"#REF!"},{"$error":"#REF!"},{"$error":"#REF!"},{"$f":"INDEX('PM 60-64'!$A$2:$E$107,J252+1,4)","v":{"$error":"#REF!"}},0,0,{"$error":"#REF!"},{"$error":"#REF!"},{"$error":"#REF!"}]
[200,{"$error":"#REF!"},{"$error":"#REF!"},{"$error":"#REF!"},{"$error":"#REF!"},{"$error":"#REF!"},{"$error":"#REF!"},{"$error":"#REF!"},{"$error":"#REF!"},{"$error":"#REF!"},{"$f":"INDEX('PM 60-64'!$A$2:$E$107,J253+1,4)","v":{"$error":"#REF!"}},0,0,{"$error":"#REF!"},{"$error":"#REF!"},{"$error":"#REF!"}]
[201,{"$error":"#REF!"},{"$error":"#REF!"},{"$error":"#REF!"},{"$error":"#REF!"},{"$error":"#REF!"},{"$error":"#REF!"},{"$error":"#REF!"},{"$error":"#REF!"},{"$error":"#REF!"},{"$f":"INDEX('PM 60-64'!$A$2:$E$107,J254+1,4)","v":{"$error":"#REF!"}},0,0,{"$error":"#REF!"},{"$error":"#REF!"},{"$error":"#REF!"}]
[202,{"$error":"#REF!"},{"$error":"#REF!"},{"$error":"#REF!"},{"$error":"#REF!"},{"$error":"#REF!"},{"$error":"#REF!"},{"$error":"#REF!"},{"$error":"#REF!"},{"$error":"#REF!"},{"$f":"INDEX('PM 60-64'!$A$2:$E$107,J255+1,4)","v":{"$error":"#REF!"}},0,0,{"$error":"#REF!"},{"$error":"#REF!"},{"$error":"#REF!"}]
[203,{"$error":"#REF!"},{"$error":"#REF!"},{"$error":"#REF!"},{"$error":"#REF!"},{"$error":"#REF!"},{"$error":"#REF!"},{"$error":"#REF!"},{"$error":"#REF!"},{"$error":"#REF!"},{"$f":"INDEX('PM 60-64'!$A$2:$E$107,J256+1,4)","v":{"$error":"#REF!"}},0,0,{"$error":"#REF!"},{"$error":"#REF!"},{"$error":"#REF!"}]
[204,{"$error":"#REF!"},{"$error":"#REF!"},{"$error":"#REF!"},{"$error":"#REF!"},{"$error":"#REF!"},{"$error":"#REF!"},{"$error":"#REF!"},{"$error":"#REF!"},{"$error":"#REF!"},{"$f":"INDEX('PM 60-64'!$A$2:$E$107,J257+1,4)","v":{"$error":"#REF!"}},0,0,{"$error":"#REF!"},{"$error":"#REF!"},{"$error":"#REF!"}]
[205,{"$error":"#REF!"},{"$error":"#REF!"},{"$error":"#REF!"},{"$f":"E257+D257","v":{"$error":"#REF!"}},{"$error":"#REF!"},{"$error":"#REF!"},{"$error":"#REF!"},{"$error":"#REF!"},{"$error":"#REF!"},{"$f":"INDEX('PM 60-64'!$A$2:$E$107,J258+1,4)","v":{"$error":"#REF!"}},0,0,{"$error":"#REF!"},{"$error":"#REF!"},{"$error":"#REF!"}]
[206,{"$error":"#REF!"},{"$error":"#REF!"},{"$error":"#REF!"},{"$error":"#REF!"},{"$error":"#REF!"},{"$error":"#REF!"},{"$error":"#REF!"},{"$error":"#REF!"},{"$error":"#REF!"},{"$f":"INDEX('PM 60-64'!$A$2:$E$107,J259+1,4)","v":{"$error":"#REF!"}},0,0,{"$error":"#REF!"},{"$error":"#REF!"},{"$error":"#REF!"}]
[207,{"$error":"#REF!"},{"$error":"#REF!"},{"$error":"#REF!"},{"$error":"#REF!"},{"$error":"#REF!"},{"$error":"#REF!"},{"$error":"#REF!"},{"$error":"#REF!"},{"$error":"#REF!"},{"$f":"INDEX('PM 60-64'!$A$2:$E$107,J260+1,4)","v":{"$error":"#REF!"}},0,0,{"$error":"#REF!"},{"$error":"#REF!"},{"$error":"#REF!"}]
[208,{"$error":"#REF!"},{"$error":"#REF!"},{"$error":"#REF!"},{"$error":"#REF!"},{"$error":"#REF!"},{"$error":"#REF!"},{"$error":"#REF!"},{"$error":"#REF!"},{"$error":"#REF!"},{"$f":"INDEX('PM 60-64'!$A$2:$E$107,J261+1,4)","v":{"$error":"#REF!"}},0,0,{"$error":"#REF!"},{"$error":"#REF!"},{"$error":"#REF!"}]
[209,{"$error":"#REF!"},{"$error":"#REF!"},{"$error":"#REF!"},{"$error":"#REF!"},{"$error":"#REF!"},{"$error":"#REF!"},{"$error":"#REF!"},{"$error":"#REF!"},{"$error":"#REF!"},{"$f":"INDEX('PM 60-64'!$A$2:$E$107,J262+1,4)","v":{"$error":"#REF!"}},0,0,{"$error":"#REF!"},{"$error":"#REF!"},{"$error":"#REF!"}]
[210,{"$error":"#REF!"},{"$error":"#REF!"},{"$error":"#REF!"},{"$error":"#REF!"},{"$error":"#REF!"},{"$error":"#REF!"},{"$error":"#REF!"},{"$error":"#REF!"},{"$error":"#REF!"},{"$f":"INDEX('PM 60-64'!$A$2:$E$107,J263+1,4)","v":{"$error":"#REF!"}},0,0,{"$error":"#REF!"},{"$error":"#REF!"},{"$error":"#REF!"}]
[211,{"$error":"#REF!"},{"$error":"#REF!"},{"$error":"#REF!"},{"$error":"#REF!"},{"$error":"#REF!"},{"$error":"#REF!"},{"$error":"#REF!"},{"$error":"#REF!"},{"$error":"#REF!"},{"$f":"INDEX('PM 60-64'!$A$2:$E$107,J264+1,4)","v":{"$error":"#REF!"}},0,0,{"$error":"#REF!"},{"$error":"#REF!"},{"$error":"#REF!"}]
[212,{"$error":"#REF!"},{"$error":"#REF!"},{"$error":"#REF!"},{"$error":"#REF!"},{"$error":"#REF!"},{"$error":"#REF!"},{"$error":"#REF!"},{"$error":"#REF!"},{"$error":"#REF!"},{"$f":"INDEX('PM 60-64'!$A$2:$E$107,J265+1,4)","v":{"$error":"#REF!"}},0,0,{"$error":"#REF!"},{"$error":"#REF!"},{"$error":"#REF!"}]
[213,{"$error":"#REF!"},{"$error":"#REF!"},{"$error":"#REF!"},{"$error":"#REF!"},{"$error":"#REF!"},{"$error":"#REF!"},{"$error":"#REF!"},{"$error":"#REF!"},{"$error":"#REF!"},{"$f":"INDEX('PM 60-64'!$A$2:$E$107,J266+1,4)","v":{"$error":"#REF!"}},0,0,{"$error":"#REF!"},{"$error":"#REF!"},{"$error":"#REF!"}]
[214,{"$error":"#REF!"},{"$error":"#REF!"},{"$error":"#REF!"},{"$error":"#REF!"},{"$error":"#REF!"},{"$error":"#REF!"},{"$error":"#REF!"},{"$error":"#REF!"},{"$error":"#REF!"},{"$f":"INDEX('PM 60-64'!$A$2:$E$107,J267+1,4)","v":{"$error":"#REF!"}},0,0,{"$error":"#REF!"},{"$error":"#REF!"},{"$error":"#REF!"}]
[215,{"$error":"#REF!"},{"$error":"#REF!"},{"$error":"#REF!"},{"$error":"#REF!"},{"$error":"#REF!"},{"$error":"#REF!"},{"$error":"#REF!"},{"$error":"#REF!"},{"$error":"#REF!"},{"$f":"INDEX('PM 60-64'!$A$2:$E$107,J268+1,4)","v":{"$error":"#REF!"}},0,0,{"$error":"#REF!"},{"$error":"#REF!"},{"$error":"#REF!"}]
[216,{"$error":"#REF!"},{"$error":"#REF!"},{"$error":"#REF!"},{"$error":"#REF!"},{"$error":"#REF!"},{"$error":"#REF!"},{"$error":"#REF!"},{"$error":"#REF!"},{"$error":"#REF!"},{"$f":"INDEX('PM 60-64'!$A$2:$E$107,J269+1,4)","v":{"$error":"#REF!"}},0,0,{"$error":"#REF!"},{"$error":"#REF!"},{"$error":"#REF!"}]
[217,{"$error":"#REF!"},{"$error":"#REF!"},{"$error":"#REF!"},{"$error":"#REF!"},{"$error":"#REF!"},{"$error":"#REF!"},{"$error":"#REF!"},{"$error":"#REF!"},{"$error":"#REF!"},{"$f":"INDEX('PM 60-64'!$A$2:$E$107,J270+1,4)","v":{"$error":"#REF!"}},0,0,{"$error":"#REF!"},{"$error":"#REF!"},{"$error":"#REF!"}]
[218,{"$error":"#REF!"},{"$error":"#REF!"},{"$error":"#REF!"},{"$error":"#REF!"},{"$error":"#REF!"},{"$error":"#REF!"},{"$error":"#REF!"},{"$error":"#REF!"},{"$error":"#REF!"},{"$f":"INDEX('PM 60-64'!$A$2:$E$107,J271+1,4)","v":{"$error":"#REF!"}},0,0,{"$error":"#REF!"},{"$error":"#REF!"},{"$error":"#REF!"}]
[219,{"$error":"#REF!"},{"$error":"#REF!"},{"$error":"#REF!"},{"$error":"#REF!"},{"$error":"#REF!"},{"$error":"#REF!"},{"$error":"#REF!"},{"$error":"#REF!"},{"$error":"#REF!"},{"$f":"INDEX('PM 60-64'!$A$2:$E$107,J272+1,4)","v":{"$error":"#REF!"}},0,0,{"$error":"#REF!"},{"$error":"#REF!"},{"$error":"#REF!"}]
[220,{"$error":"#REF!"},{"$error":"#REF!"},{"$error":"#REF!"},{"$error":"#REF!"},{"$error":"#REF!"},{"$error":"#REF!"},{"$error":"#REF!"},{"$error":"#REF!"},{"$error":"#REF!"},{"$f":"INDEX('PM 60-64'!$A$2:$E$107,J273+1,4)","v":{"$error":"#REF!"}},0,0,{"$error":"#REF!"},{"$error":"#REF!"},{"$error":"#REF!"}]
[221,{"$error":"#REF!"},{"$error":"#REF!"},{"$error":"#REF!"},{"$error":"#REF!"},{"$error":"#REF!"},{"$error":"#REF!"},{"$error":"#REF!"},{"$error":"#REF!"},{"$error":"#REF!"},{"$f":"INDEX('PM 60-64'!$A$2:$E$107,J274+1,4)","v":{"$error":"#REF!"}},0,0,{"$error":"#REF!"},{"$error":"#REF!"},{"$error":"#REF!"}]
[222,{"$error":"#REF!"},{"$error":"#REF!"},{"$error":"#REF!"},{"$error":"#REF!"},{"$error":"#REF!"},{"$error":"#REF!"},{"$error":"#REF!"},{"$error":"#REF!"},{"$error":"#REF!"},{"$f":"INDEX('PM 60-64'!$A$2:$E$107,J275+1,4)","v":{"$error":"#REF!"}},0,0,{"$error":"#REF!"},{"$error":"#REF!"},{"$error":"#REF!"}]
[223,{"$error":"#REF!"},{"$error":"#REF!"},{"$error":"#REF!"},{"$error":"#REF!"},{"$error":"#REF!"},{"$error":"#REF!"},{"$error":"#REF!"},{"$error":"#REF!"},{"$error":"#REF!"},{"$f":"INDEX('PM 60-64'!$A$2:$E$107,J276+1,4)","v":{"$error":"#REF!"}},0,0,{"$error":"#REF!"},{"$error":"#REF!"},{"$error":"#REF!"}]
[224,{"$error":"#REF!"},{"$error":"#REF!"},{"$error":"#REF!"},{"$error":"#REF!"},{"$error":"#REF!"},{"$error":"#REF!"},{"$error":"#REF!"},{"$error":"#REF!"},{"$error":"#REF!"},{"$f":"INDEX('PM 60-64'!$A$2:$E$107,J277+1,4)","v":{"$error":"#REF!"}},0,0,{"$error":"#REF!"},{"$error":"#REF!"},{"$error":"#REF!"}]
[225,{"$error":"#REF!"},{"$error":"#REF!"},{"$error":"#REF!"},{"$error":"#REF!"},{"$error":"#REF!"},{"$error":"#REF!"},{"$error":"#REF!"},{"$error":"#REF!"},{"$error":"#REF!"},{"$f":"INDEX('PM 60-64'!$A$2:$E$107,J278+1,4)","v":{"$error":"#REF!"}},0,0,{"$error":"#REF!"},{"$error":"#REF!"},{"$error":"#REF!"}]
[226,{"$error":"#REF!"},{"$error":"#REF!"},{"$error":"#REF!"},{"$error":"#REF!"},{"$error":"#REF!"},{"$error":"#REF!"},{"$error":"#REF!"},{"$error":"#REF!"},{"$error":"#REF!"},{"$f":"INDEX('PM 60-64'!$A$2:$E$107,J279+1,4)","v":{"$error":"#REF!"}},0,0,{"$error":"#REF!"},{"$error":"#REF!"},{"$error":"#REF!"}]
[227,{"$error":"#REF!"},{"$error":"#REF!"},{"$error":"#REF!"},{"$error":"#REF!"},{"$error":"#REF!"},{"$error":"#REF!"},{"$error":"#REF!"},{"$error":"#REF!"},{"$error":"#REF!"},{"$f":"INDEX('PM 60-64'!$A$2:$E$107,J280+1,4)","v":{"$error":"#REF!"}},0,0,{"$error":"#REF!"},{"$error":"#REF!"},{"$error":"#REF!"}]
[228,{"$error":"#REF!"},{"$error":"#REF!"},{"$error":"#REF!"},{"$error":"#REF!"},{"$error":"#REF!"},{"$error":"#REF!"},{"$error":"#REF!"},{"$error":"#REF!"},{"$error":"#REF!"},{"$f":"INDEX('PM 60-64'!$A$2:$E$107,J281+1,4)","v":{"$error":"#REF!"}},0,0,{"$error":"#REF!"},{"$error":"#REF!"},{"$error":"#REF!"}]
[229,{"$error":"#REF!"},{"$error":"#REF!"},{"$error":"#REF!"},{"$error":"#REF!"},{"$error":"#REF!"},{"$error":"#REF!"},{"$error":"#REF!"},{"$error":"#REF!"},{"$error":"#REF!"},{"$f":"INDEX('PM 60-64'!$A$2:$E$107,J282+1,4)","v":{"$error":"#REF!"}},0,0,{"$error":"#REF!"},{"$error":"#REF!"},{"$error":"#REF!"}]
[230,{"$error":"#REF!"},{"$error":"#REF!"},{"$error":"#REF!"},{"$error":"#REF!"},{"$error":"#REF!"},{"$error":"#REF!"},{"$error":"#REF!"},{"$error":"#REF!"},{"$error":"#REF!"},{"$f":"INDEX('PM 60-64'!$A$2:$E$107,J283+1,4)","v":{"$error":"#REF!"}},0,0,{"$error":"#REF!"},{"$error":"#REF!"},{"$error":"#REF!"}]
[231,{"$error":"#REF!"},{"$error":"#REF!"},{"$error":"#REF!"},{"$error":"#REF!"},{"$error":"#REF!"},{"$error":"#REF!"},{"$error":"#REF!"},{"$error":"#REF!"},{"$error":"#REF!"},{"$f":"INDEX('PM 60-64'!$A$2:$E$107,J284+1,4)","v":{"$error":"#REF!"}},0,0,{"$error":"#REF!"},{"$error":"#REF!"},{"$error":"#REF!"}]
[232,{"$error":"#REF!"},{"$error":"#REF!"},{"$error":"#REF!"},{"$error":"#REF!"},{"$error":"#REF!"},{"$error":"#REF!"},{"$error":"#REF!"},{"$error":"#REF!"},{"$error":"#REF!"},{"$f":"INDEX('PM 60-64'!$A$2:$E$107,J285+1,4)","v":{"$error":"#REF!"}},0,0,{"$error":"#REF!"},{"$error":"#REF!"},{"$error":"#REF!"}]
[233,{"$error":"#REF!"},{"$error":"#REF!"},{"$error":"#REF!"},{"$error":"#REF!"},{"$error":"#REF!"},{"$error":"#REF!"},{"$error":"#REF!"},{"$error":"#REF!"},{"$error":"#REF!"},{"$f":"INDEX('PM 60-64'!$A$2:$E$107,J286+1,4)","v":{"$error":"#REF!"}},0,0,{"$error":"#REF!"},{"$error":"#REF!"},{"$error":"#REF!"}]
[234,{"$error":"#REF!"},{"$error":"#REF!"},{"$error":"#REF!"},{"$error":"#REF!"},{"$error":"#REF!"},{"$error":"#REF!"},{"$error":"#REF!"},{"$error":"#REF!"},{"$error":"#REF!"},{"$f":"INDEX('PM 60-64'!$A$2:$E$107,J287+1,4)","v":{"$error":"#REF!"}},0,0,{"$error":"#REF!"},{"$error":"#REF!"},{"$error":"#REF!"}]
[235,{"$error":"#REF!"},{"$error":"#REF!"},{"$error":"#REF!"},{"$error":"#REF!"},{"$error":"#REF!"},{"$error":"#REF!"},{"$error":"#REF!"},{"$error":"#REF!"},{"$error":"#REF!"},{"$f":"INDEX('PM 60-64'!$A$2:$E$107,J288+1,4)","v":{"$error":"#REF!"}},0,0,{"$error":"#REF!"},{"$error":"#REF!"},{"$error":"#REF!"}]
[236,{"$error":"#REF!"},{"$error":"#REF!"},{"$error":"#REF!"},{"$error":"#REF!"},{"$error":"#REF!"},{"$error":"#REF!"},{"$error":"#REF!"},{"$error":"#REF!"},{"$error":"#REF!"},{"$f":"INDEX('PM 60-64'!$A$2:$E$107,J289+1,4)","v":{"$error":"#REF!"}},0,0,{"$error":"#REF!"},{"$error":"#REF!"},{"$error":"#REF!"}]
[237,{"$error":"#REF!"},{"$error":"#REF!"},{"$error":"#REF!"},{"$error":"#REF!"},{"$error":"#REF!"},{"$error":"#REF!"},{"$error":"#REF!"},{"$error":"#REF!"},{"$error":"#REF!"},{"$f":"INDEX('PM 60-64'!$A$2:$E$107,J290+1,4)","v":{"$error":"#REF!"}},0,0,{"$error":"#REF!"},{"$error":"#REF!"},{"$error":"#REF!"}]
[238,{"$error":"#REF!"},{"$error":"#REF!"},{"$error":"#REF!"},{"$error":"#REF!"},{"$error":"#REF!"},{"$error":"#REF!"},{"$error":"#REF!"},{"$error":"#REF!"},{"$error":"#REF!"},{"$f":"INDEX('PM 60-64'!$A$2:$E$107,J291+1,4)","v":{"$error":"#REF!"}},0,0,{"$error":"#REF!"},{"$error":"#REF!"},{"$error":"#REF!"}]
[239,{"$error":"#REF!"},{"$error":"#REF!"},{"$error":"#REF!"},{"$error":"#REF!"},{"$error":"#REF!"},{"$error":"#REF!"},{"$error":"#REF!"},{"$error":"#REF!"},{"$error":"#REF!"},{"$f":"INDEX('PM 60-64'!$A$2:$E$107,J292+1,4)","v":{"$error":"#REF!"}},0,0,{"$error":"#REF!"},{"$error":"#REF!"},{"$error":"#REF!"}]
[240,{"$error":"#REF!"},{"$error":"#REF!"},{"$error":"#REF!"},{"$error":"#REF!"},{"$error":"#REF!"},{"$error":"#REF!"},{"$error":"#REF!"},{"$error":"#REF!"},{"$error":"#REF!"},{"$f":"INDEX('PM 60-64'!$A$2:$E$107,J293+1,4)","v":{"$error":"#REF!"}},0,0,{"$error":"#REF!"},{"$error":"#REF!"},{"$error":"#REF!"}]
[241,{"$error":"#REF!"},{"$error":"#REF!"},{"$error":"#REF!"},{"$error":"#REF!"},{"$error":"#REF!"},{"$error":"#REF!"},{"$error":"#REF!"},{"$error":"#REF!"},{"$error":"#REF!"},{"$f":"INDEX('PM 60-64'!$A$2:$E$107,J294+1,4)","v":{"$error":"#REF!"}},0,0,{"$error":"#REF!"},{"$error":"#REF!"},{"$error":"#REF!"}]
[242,{"$error":"#REF!"},{"$error":"#REF!"},{"$error":"#REF!"},{"$error":"#REF!"},{"$error":"#REF!"},{"$error":"#REF!"},{"$error":"#REF!"},{"$error":"#REF!"},{"$error":"#REF!"},{"$f":"INDEX('PM 60-64'!$A$2:$E$107,J295+1,4)","v":{"$error":"#REF!"}},0,0,{"$error":"#REF!"},{"$error":"#REF!"},{"$error":"#REF!"}]
[243,{"$error":"#REF!"},{"$error":"#REF!"},{"$error":"#REF!"},{"$error":"#REF!"},{"$error":"#REF!"},{"$error":"#REF!"},{"$error":"#REF!"},{"$error":"#REF!"},{"$error":"#REF!"},{"$f":"INDEX('PM 60-64'!$A$2:$E$107,J296+1,4)","v":{"$error":"#REF!"}},0,0,{"$error":"#REF!"},{"$error":"#REF!"},{"$error":"#REF!"}]
[244,{"$error":"#REF!"},{"$error":"#REF!"},{"$error":"#REF!"},{"$error":"#REF!"},{"$error":"#REF!"},{"$error":"#REF!"},{"$error":"#REF!"},{"$error":"#REF!"},{"$error":"#REF!"},{"$f":"INDEX('PM 60-64'!$A$2:$E$107,J297+1,4)","v":{"$error":"#REF!"}},0,0,{"$error":"#REF!"},{"$error":"#REF!"},{"$error":"#REF!"}]
[245,{"$error":"#REF!"},{"$error":"#REF!"},{"$error":"#REF!"},{"$error":"#REF!"},{"$error":"#REF!"},{"$error":"#REF!"},{"$error":"#REF!"},{"$error":"#REF!"},{"$error":"#REF!"},{"$f":"INDEX('PM 60-64'!$A$2:$E$107,J298+1,4)","v":{"$error":"#REF!"}},0,0,{"$error":"#REF!"},{"$error":"#REF!"},{"$error":"#REF!"}]
[246,{"$error":"#REF!"},{"$error":"#REF!"},{"$error":"#REF!"},{"$error":"#REF!"},{"$error":"#REF!"},{"$error":"#REF!"},{"$error":"#REF!"},{"$error":"#REF!"},{"$error":"#REF!"},{"$f":"INDEX('PM 60-64'!$A$2:$E$107,J299+1,4)","v":{"$error":"#REF!"}},0,0,{"$error":"#REF!"},{"$error":"#REF!"},{"$error":"#REF!"}]
[247,{"$error":"#REF!"},{"$error":"#REF!"},{"$error":"#REF!"},{"$error":"#REF!"},{"$error":"#REF!"},{"$error":"#REF!"},{"$error":"#REF!"},{"$error":"#REF!"},{"$error":"#REF!"},{"$f":"INDEX('PM 60-64'!$A$2:$E$107,J300+1,4)","v":{"$error":"#REF!"}},0,0,{"$error":"#REF!"},{"$error":"#REF!"},{"$error":"#REF!"}]
[248,{"$error":"#REF!"},{"$error":"#REF!"},{"$error":"#REF!"},{"$error":"#REF!"},{"$error":"#REF!"},{"$error":"#REF!"},{"$error":"#REF!"},{"$error":"#REF!"},{"$error":"#REF!"},{"$f":"INDEX('PM 60-64'!$A$2:$E$107,J301+1,4)","v":{"$error":"#REF!"}},0,0,{"$error":"#REF!"},{"$error":"#REF!"},{"$error":"#REF!"}]
[249,{"$error":"#REF!"},{"$error":"#REF!"},{"$error":"#REF!"},{"$error":"#REF!"},{"$error":"#REF!"},{"$error":"#REF!"},{"$error":"#REF!"},{"$error":"#REF!"},{"$error":"#REF!"},{"$f":"INDEX('PM 60-64'!$A$2:$E$107,J302+1,4)","v":{"$error":"#REF!"}},0,0,{"$error":"#REF!"},{"$error":"#REF!"},{"$error":"#REF!"}]
[250,{"$error":"#REF!"},{"$error":"#REF!"},{"$error":"#REF!"},{"$error":"#REF!"},{"$error":"#REF!"},{"$error":"#REF!"},{"$error":"#REF!"},{"$error":"#REF!"},{"$error":"#REF!"},{"$f":"INDEX('PM 60-64'!$A$2:$E$107,J303+1,4)","v":{"$error":"#REF!"}},0,0,{"$error":"#REF!"},{"$error":"#REF!"},{"$error":"#REF!"}]
[251,{"$error":"#REF!"},{"$error":"#REF!"},{"$error":"#REF!"},{"$error":"#REF!"},{"$error":"#REF!"},{"$error":"#REF!"},{"$error":"#REF!"},{"$error":"#REF!"},{"$error":"#REF!"},{"$f":"INDEX('PM 60-64'!$A$2:$E$107,J304+1,4)","v":{"$error":"#REF!"}},0,0,{"$error":"#REF!"},{"$error":"#REF!"},{"$error":"#REF!"}]
[252,{"$error":"#REF!"},{"$error":"#REF!"},{"$error":"#REF!"},{"$error":"#REF!"},{"$error":"#REF!"},{"$error":"#REF!"},{"$error":"#REF!"},{"$error":"#REF!"},{"$error":"#REF!"},{"$f":"INDEX('PM 60-64'!$A$2:$E$107,J305+1,4)","v":{"$error":"#REF!"}},0,0,{"$error":"#REF!"},{"$error":"#REF!"},{"$error":"#REF!"}]
[253,{"$error":"#REF!"},{"$error":"#REF!"},{"$error":"#REF!"},{"$error":"#REF!"},{"$error":"#REF!"},{"$error":"#REF!"},{"$error":"#REF!"},{"$error":"#REF!"},{"$error":"#REF!"},{"$f":"INDEX('PM 60-64'!$A$2:$E$107,J306+1,4)","v":{"$error":"#REF!"}},0,0,{"$error":"#REF!"},{"$error":"#REF!"},{"$error":"#REF!"}]
[254,{"$error":"#REF!"},{"$error":"#REF!"},{"$error":"#REF!"},{"$error":"#REF!"},{"$error":"#REF!"},{"$error":"#REF!"},{"$error":"#REF!"},{"$error":"#REF!"},{"$error":"#REF!"},{"$f":"INDEX('PM 60-64'!$A$2:$E$107,J307+1,4)","v":{"$error":"#REF!"}},0,0,{"$error":"#REF!"},{"$error":"#REF!"},{"$error":"#REF!"}]
[255,{"$error":"#REF!"},{"$error":"#REF!"},{"$error":"#REF!"},{"$error":"#REF!"},{"$error":"#REF!"},{"$error":"#REF!"},{"$error":"#REF!"},{"$error":"#REF!"},{"$error":"#REF!"},{"$f":"INDEX('PM 60-64'!$A$2:$E$107,J308+1,4)","v":{"$error":"#REF!"}},0,0,{"$error":"#REF!"},{"$error":"#REF!"},{"$error":"#REF!"}]
[256,{"$error":"#REF!"},{"$error":"#REF!"},{"$error":"#REF!"},{"$error":"#REF!"},{"$error":"#REF!"},{"$error":"#REF!"},{"$error":"#REF!"},{"$error":"#REF!"},{"$error":"#REF!"},{"$f":"INDEX('PM 60-64'!$A$2:$E$107,J309+1,4)","v":{"$error":"#REF!"}},0,0,{"$error":"#REF!"},{"$error":"#REF!"},{"$error":"#REF!"}]
[257,{"$error":"#REF!"},{"$error":"#REF!"},{"$f":"$I$9","v":{"$error":"#REF!"}},{"$error":"#REF!"},{"$error":"#REF!"},{"$error":"#REF!"},{"$error":"#REF!"},{"$f":"ROUND(D310-F310-G310-H310,1)","v":{"$error":"#REF!"}},{"$error":"#REF!"},{"$f":"INDEX('PM 60-64'!$A$2:$E$107,J310+1,4)","v":{"$error":"#REF!"}},0,0,{"$f":"I310+M310","v":{"$error":"#REF!"}},{"$error":"#REF!"},{"$error":"#REF!"}]
[258,{"$error":"#REF!"},{"$f":"B311","v":{"$error":"#REF!"}},{"$error":"#REF!"},{"$error":"#REF!"},{"$f":"IF($I$8=\"O\",IF(12*(YEAR(C311)-YEAR($J$3))+MONTH(C311)-MONTH($J$3)+1>12,0,D311*$I$6*MIN($I$7,$O$3)),D311*$I$6)","v":{"$error":"#REF!"}},{"$f":"IF($M$10=\"Ppure\",ROUND((D311-F311)*$M$6/(1+$M$6+$M$7),0),ROUND(D311*$M$6,0))","v":{"$error":"#REF!"}},{"$f":"IF($M$10=\"Ppure\",ROUND((D311-F311)*$M$7/(1+$M$6+$M$7),0),ROUND(D311*$M$7,0))","v":{"$error":"#REF!"}},{"$error":"#REF!"},{"$f":"INT(YEAR(C311)-YEAR($Q$6)+$O$4+0*(MONTH(C311)-MONTH($Q$6))/12)","v":{"$error":"#REF!"}},{"$f":"INDEX('PM 60-64'!$A$2:$E$107,J311+1,4)","v":{"$error":"#REF!"}},{"$f":"IF(A311>120,0,ROUND((K311*(1+$Q$7)*(1+$C$8)^(-0.5)+$Q$10)*(1+$M$9)*$Q$9,0))","v":0},{"$f":"ROUND(-L311/12,0)","v":0},{"$error":"#REF!"},{"$error":"#REF!"},{"$f":"(O311+N311)*(1+$C$10)","v":{"$error":"#REF!"}}]
[259,{"$f":"DATE(YEAR(B311),MONTH(B311)+1,DAY(B311))","v":{"$error":"#REF!"}},{"$error":"#REF!"},{"$error":"#REF!"},{"$f":"E311+D311","v":{"$error":"#REF!"}},{"$error":"#REF!"},{"$error":"#REF!"},{"$error":"#REF!"},{"$error":"#REF!"},{"$error":"#REF!"},{"$f":"INDEX('PM 60-64'!$A$2:$E$107,J312+1,4)","v":{"$error":"#REF!"}},0,0,{"$error":"#REF!"},{"$f":"P311","v":{"$error":"#REF!"}},{"$error":"#REF!"}]
[260,{"$error":"#REF!"},{"$error":"#REF!"},{"$error":"#REF!"},{"$error":"#REF!"},{"$error":"#REF!"},{"$error":"#REF!"},{"$error":"#REF!"},{"$error":"#REF!"},{"$error":"#REF!"},{"$f":"INDEX('PM 60-64'!$A$2:$E$107,J313+1,4)","v":{"$error":"#REF!"}},0,0,{"$error":"#REF!"},{"$error":"#REF!"},{"$error":"#REF!"}]
[261,{"$error":"#REF!"},{"$error":"#REF!"},{"$error":"#REF!"},{"$error":"#REF!"},{"$error":"#REF!"},{"$error":"#REF!"},{"$error":"#REF!"},{"$error":"#REF!"},{"$error":"#REF!"},{"$f":"INDEX('PM 60-64'!$A$2:$E$107,J314+1,4)","v":{"$error":"#REF!"}},0,0,{"$error":"#REF!"},{"$error":"#REF!"},{"$error":"#REF!"}]
[262,{"$error":"#REF!"},{"$error":"#REF!"},{"$error":"#REF!"},{"$error":"#REF!"},{"$error":"#REF!"},{"$error":"#REF!"},{"$error":"#REF!"},{"$error":"#REF!"},{"$error":"#REF!"},{"$f":"INDEX('PM 60-64'!$A$2:$E$107,J315+1,4)","v":{"$error":"#REF!"}},0,0,{"$error":"#REF!"},{"$error":"#REF!"},{"$error":"#REF!"}]
[263,{"$error":"#REF!"},{"$error":"#REF!"},{"$error":"#REF!"},{"$error":"#REF!"},{"$error":"#REF!"},{"$error":"#REF!"},{"$error":"#REF!"},{"$error":"#REF!"},{"$error":"#REF!"},{"$f":"INDEX('PM 60-64'!$A$2:$E$107,J316+1,4)","v":{"$error":"#REF!"}},0,0,{"$error":"#REF!"},{"$error":"#REF!"},{"$error":"#REF!"}]
[264,{"$error":"#REF!"},{"$error":"#REF!"},{"$error":"#REF!"},{"$error":"#REF!"},{"$error":"#REF!"},{"$error":"#REF!"},{"$error":"#REF!"},{"$error":"#REF!"},{"$error":"#REF!"},{"$f":"INDEX('PM 60-64'!$A$2:$E$107,J317+1,4)","v":{"$error":"#REF!"}},0,0,{"$error":"#REF!"},{"$error":"#REF!"},{"$error":"#REF!"}]
[265,{"$error":"#REF!"},{"$error":"#REF!"},{"$error":"#REF!"},{"$error":"#REF!"},{"$error":"#REF!"},{"$error":"#REF!"},{"$error":"#REF!"},{"$error":"#REF!"},{"$error":"#REF!"},{"$f":"INDEX('PM 60-64'!$A$2:$E$107,J318+1,4)","v":{"$error":"#REF!"}},0,0,{"$error":"#REF!"},{"$error":"#REF!"},{"$error":"#REF!"}]
[266,{"$error":"#REF!"},{"$error":"#REF!"},{"$error":"#REF!"},{"$error":"#REF!"},{"$error":"#REF!"},{"$error":"#REF!"},{"$error":"#REF!"},{"$error":"#REF!"},{"$error":"#REF!"},{"$f":"INDEX('PM 60-64'!$A$2:$E$107,J319+1,4)","v":{"$error":"#REF!"}},0,0,{"$error":"#REF!"},{"$error":"#REF!"},{"$error":"#REF!"}]
[267,{"$error":"#REF!"},{"$error":"#REF!"},{"$error":"#REF!"},{"$error":"#REF!"},{"$error":"#REF!"},{"$error":"#REF!"},{"$error":"#REF!"},{"$error":"#REF!"},{"$error":"#REF!"},{"$f":"INDEX('PM 60-64'!$A$2:$E$107,J320+1,4)","v":{"$error":"#REF!"}},0,0,{"$error":"#REF!"},{"$error":"#REF!"},{"$error":"#REF!"}]
[268,{"$error":"#REF!"},{"$error":"#REF!"},{"$error":"#REF!"},{"$error":"#REF!"},{"$error":"#REF!"},{"$error":"#REF!"},{"$error":"#REF!"},{"$error":"#REF!"},{"$error":"#REF!"},{"$f":"INDEX('PM 60-64'!$A$2:$E$107,J321+1,4)","v":{"$error":"#REF!"}},0,0,{"$error":"#REF!"},{"$error":"#REF!"},{"$error":"#REF!"}]
[269,{"$error":"#REF!"},{"$error":"#REF!"},{"$error":"#REF!"},{"$error":"#REF!"},{"$error":"#REF!"},{"$error":"#REF!"},{"$error":"#REF!"},{"$error":"#REF!"},{"$error":"#REF!"},{"$f":"INDEX('PM 60-64'!$A$2:$E$107,J322+1,4)","v":{"$error":"#REF!"}},0,0,{"$error":"#REF!"},{"$error":"#REF!"},{"$error":"#REF!"}]
[270,{"$error":"#REF!"},{"$error":"#REF!"},{"$error":"#REF!"},{"$error":"#REF!"},{"$error":"#REF!"},{"$error":"#REF!"},{"$error":"#REF!"},{"$error":"#REF!"},{"$error":"#REF!"},{"$f":"INDEX('PM 60-64'!$A$2:$E$107,J323+1,4)","v":{"$error":"#REF!"}},0,0,{"$error":"#REF!"},{"$error":"#REF!"},{"$error":"#REF!"}]
[271,{"$error":"#REF!"},{"$error":"#REF!"},{"$error":"#REF!"},{"$error":"#REF!"},{"$error":"#REF!"},{"$error":"#REF!"},{"$error":"#REF!"},{"$error":"#REF!"},{"$error":"#REF!"},{"$f":"INDEX('PM 60-64'!$A$2:$E$107,J324+1,4)","v":{"$error":"#REF!"}},0,0,{"$error":"#REF!"},{"$error":"#REF!"},{"$error":"#REF!"}]
[272,{"$error":"#REF!"},{"$error":"#REF!"},{"$error":"#REF!"},{"$error":"#REF!"},{"$error":"#REF!"},{"$error":"#REF!"},{"$error":"#REF!"},{"$error":"#REF!"},{"$error":"#REF!"},{"$f":"INDEX('PM 60-64'!$A$2:$E$107,J325+1,4)","v":{"$error":"#REF!"}},0,0,{"$error":"#REF!"},{"$error":"#REF!"},{"$error":"#REF!"}]
[273,{"$error":"#REF!"},{"$error":"#REF!"},{"$error":"#REF!"},{"$error":"#REF!"},{"$error":"#REF!"},{"$error":"#REF!"},{"$error":"#REF!"},{"$error":"#REF!"},{"$error":"#REF!"},{"$f":"INDEX('PM 60-64'!$A$2:$E$107,J326+1,4)","v":{"$error":"#REF!"}},0,0,{"$error":"#REF!"},{"$error":"#REF!"},{"$error":"#REF!"}]
[274,{"$error":"#REF!"},{"$error":"#REF!"},{"$error":"#REF!"},{"$error":"#REF!"},{"$error":"#REF!"},{"$error":"#REF!"},{"$error":"#REF!"},{"$error":"#REF!"},{"$error":"#REF!"},{"$f":"INDEX('PM 60-64'!$A$2:$E$107,J327+1,4)","v":{"$error":"#REF!"}},0,0,{"$error":"#REF!"},{"$error":"#REF!"},{"$error":"#REF!"}]
[275,{"$error":"#REF!"},{"$error":"#REF!"},{"$error":"#REF!"},{"$error":"#REF!"},{"$error":"#REF!"},{"$error":"#REF!"},{"$error":"#REF!"},{"$error":"#REF!"},{"$error":"#REF!"},{"$f":"INDEX('PM 60-64'!$A$2:$E$107,J328+1,4)","v":{"$error":"#REF!"}},0,0,{"$error":"#REF!"},{"$error":"#REF!"},{"$error":"#REF!"}]
[276,{"$error":"#REF!"},{"$error":"#REF!"},{"$error":"#REF!"},{"$error":"#REF!"},{"$error":"#REF!"},{"$error":"#REF!"},{"$error":"#REF!"},{"$error":"#REF!"},{"$error":"#REF!"},{"$f":"INDEX('PM 60-64'!$A$2:$E$107,J329+1,4)","v":{"$error":"#REF!"}},0,0,{"$error":"#REF!"},{"$error":"#REF!"},{"$error":"#REF!"}]
[277,{"$error":"#REF!"},{"$error":"#REF!"},{"$error":"#REF!"},{"$error":"#REF!"},{"$error":"#REF!"},{"$error":"#REF!"},{"$error":"#REF!"},{"$error":"#REF!"},{"$error":"#REF!"},{"$f":"INDEX('PM 60-64'!$A$2:$E$107,J330+1,4)","v":{"$error":"#REF!"}},0,0,{"$error":"#REF!"},{"$error":"#REF!"},{"$error":"#REF!"}]
[278,{"$error":"#REF!"},{"$error":"#REF!"},{"$error":"#REF!"},{"$error":"#REF!"},{"$error":"#REF!"},{"$error":"#REF!"},{"$error":"#REF!"},{"$error":"#REF!"},{"$error":"#REF!"},{"$f":"INDEX('PM 60-64'!$A$2:$E$107,J331+1,4)","v":{"$error":"#REF!"}},0,0,{"$error":"#REF!"},{"$error":"#REF!"},{"$error":"#REF!"}]
[279,{"$error":"#REF!"},{"$error":"#REF!"},{"$error":"#REF!"},{"$error":"#REF!"},{"$error":"#REF!"},{"$error":"#REF!"},{"$error":"#REF!"},{"$error":"#REF!"},{"$error":"#REF!"},{"$f":"INDEX('PM 60-64'!$A$2:$E$107,J332+1,4)","v":{"$error":"#REF!"}},0,0,{"$error":"#REF!"},{"$error":"#REF!"},{"$error":"#REF!"}]
[280,{"$error":"#REF!"},{"$error":"#REF!"},{"$error":"#REF!"},{"$error":"#REF!"},{"$error":"#REF!"},{"$error":"#REF!"},{"$error":"#REF!"},{"$error":"#REF!"},{"$error":"#REF!"},{"$f":"INDEX('PM 60-64'!$A$2:$E$107,J333+1,4)","v":{"$error":"#REF!"}},0,0,{"$error":"#REF!"},{"$error":"#REF!"},{"$error":"#REF!"}]
[281,{"$error":"#REF!"},{"$error":"#REF!"},{"$error":"#REF!"},{"$error":"#REF!"},{"$error":"#REF!"},{"$error":"#REF!"},{"$error":"#REF!"},{"$error":"#REF!"},{"$error":"#REF!"},{"$f":"INDEX('PM 60-64'!$A$2:$E$107,J334+1,4)","v":{"$error":"#REF!"}},0,0,{"$error":"#REF!"},{"$error":"#REF!"},{"$error":"#REF!"}]
[282,{"$error":"#REF!"},{"$error":"#REF!"},{"$error":"#REF!"},{"$error":"#REF!"},{"$error":"#REF!"},{"$error":"#REF!"},{"$error":"#REF!"},{"$error":"#REF!"},{"$error":"#REF!"},{"$f":"INDEX('PM 60-64'!$A$2:$E$107,J335+1,4)","v":{"$error":"#REF!"}},0,0,{"$error":"#REF!"},{"$error":"#REF!"},{"$error":"#REF!"}]
[283,{"$error":"#REF!"},{"$error":"#REF!"},{"$error":"#REF!"},{"$error":"#REF!"},{"$error":"#REF!"},{"$error":"#REF!"},{"$error":"#REF!"},{"$error":"#REF!"},{"$error":"#REF!"},{"$f":"INDEX('PM 60-64'!$A$2:$E$107,J336+1,4)","v":{"$error":"#REF!"}},0,0,{"$error":"#REF!"},{"$error":"#REF!"},{"$error":"#REF!"}]
[284,{"$error":"#REF!"},{"$error":"#REF!"},{"$error":"#REF!"},{"$error":"#REF!"},{"$error":"#REF!"},{"$error":"#REF!"},{"$error":"#REF!"},{"$error":"#REF!"},{"$error":"#REF!"},{"$f":"INDEX('PM 60-64'!$A$2:$E$107,J337+1,4)","v":{"$error":"#REF!"}},0,0,{"$error":"#REF!"},{"$error":"#REF!"},{"$error":"#REF!"}]
[285,{"$error":"#REF!"},{"$error":"#REF!"},{"$error":"#REF!"},{"$error":"#REF!"},{"$error":"#REF!"},{"$error":"#REF!"},{"$error":"#REF!"},{"$error":"#REF!"},{"$error":"#REF!"},{"$f":"INDEX('PM 60-64'!$A$2:$E$107,J338+1,4)","v":{"$error":"#REF!"}},0,0,{"$error":"#REF!"},{"$error":"#REF!"},{"$error":"#REF!"}]
[286,{"$error":"#REF!"},{"$error":"#REF!"},{"$error":"#REF!"},{"$error":"#REF!"},{"$error":"#REF!"},{"$error":"#REF!"},{"$error":"#REF!"},{"$error":"#REF!"},{"$error":"#REF!"},{"$f":"INDEX('PM 60-64'!$A$2:$E$107,J339+1,4)","v":{"$error":"#REF!"}},0,0,{"$error":"#REF!"},{"$error":"#REF!"},{"$error":"#REF!"}]
[287,{"$error":"#REF!"},{"$error":"#REF!"},{"$error":"#REF!"},{"$error":"#REF!"},{"$error":"#REF!"},{"$error":"#REF!"},{"$error":"#REF!"},{"$error":"#REF!"},{"$error":"#REF!"},{"$f":"INDEX('PM 60-64'!$A$2:$E$107,J340+1,4)","v":{"$error":"#REF!"}},0,0,{"$error":"#REF!"},{"$error":"#REF!"},{"$error":"#REF!"}]
[288,{"$error":"#REF!"},{"$error":"#REF!"},{"$error":"#REF!"},{"$error":"#REF!"},{"$error":"#REF!"},{"$error":"#REF!"},{"$error":"#REF!"},{"$error":"#REF!"},{"$error":"#REF!"},{"$f":"INDEX('PM 60-64'!$A$2:$E$107,J341+1,4)","v":{"$error":"#REF!"}},0,0,{"$error":"#REF!"},{"$error":"#REF!"},{"$error":"#REF!"}]
[289,{"$error":"#REF!"},{"$error":"#REF!"},{"$error":"#REF!"},{"$error":"#REF!"},{"$error":"#REF!"},{"$error":"#REF!"},{"$error":"#REF!"},{"$error":"#REF!"},{"$error":"#REF!"},{"$f":"INDEX('PM 60-64'!$A$2:$E$107,J342+1,4)","v":{"$error":"#REF!"}},0,0,{"$error":"#REF!"},{"$error":"#REF!"},{"$error":"#REF!"}]
[290,{"$error":"#REF!"},{"$error":"#REF!"},{"$error":"#REF!"},{"$error":"#REF!"},{"$error":"#REF!"},{"$error":"#REF!"},{"$error":"#REF!"},{"$error":"#REF!"},{"$error":"#REF!"},{"$f":"INDEX('PM 60-64'!$A$2:$E$107,J343+1,4)","v":{"$error":"#REF!"}},0,0,{"$error":"#REF!"},{"$error":"#REF!"},{"$error":"#REF!"}]
[291,{"$error":"#REF!"},{"$error":"#REF!"},{"$error":"#REF!"},{"$error":"#REF!"},{"$error":"#REF!"},{"$error":"#REF!"},{"$error":"#REF!"},{"$error":"#REF!"},{"$error":"#REF!"},{"$f":"INDEX('PM 60-64'!$A$2:$E$107,J344+1,4)","v":{"$error":"#REF!"}},0,0,{"$error":"#REF!"},{"$error":"#REF!"},{"$error":"#REF!"}]
[292,{"$error":"#REF!"},{"$error":"#REF!"},{"$error":"#REF!"},{"$error":"#REF!"},{"$error":"#REF!"},{"$error":"#REF!"},{"$error":"#REF!"},{"$error":"#REF!"},{"$error":"#REF!"},{"$f":"INDEX('PM 60-64'!$A$2:$E$107,J345+1,4)","v":{"$error":"#REF!"}},0,0,{"$error":"#REF!"},{"$error":"#REF!"},{"$error":"#REF!"}]
[293,{"$error":"#REF!"},{"$error":"#REF!"},{"$error":"#REF!"},{"$error":"#REF!"},{"$error":"#REF!"},{"$error":"#REF!"},{"$error":"#REF!"},{"$error":"#REF!"},{"$error":"#REF!"},{"$f":"INDEX('PM 60-64'!$A$2:$E$107,J346+1,4)","v":{"$error":"#REF!"}},0,0,{"$error":"#REF!"},{"$error":"#REF!"},{"$error":"#REF!"}]
[294,{"$error":"#REF!"},{"$error":"#REF!"},{"$error":"#REF!"},{"$error":"#REF!"},{"$error":"#REF!"},{"$error":"#REF!"},{"$error":"#REF!"},{"$error":"#REF!"},{"$error":"#REF!"},{"$f":"INDEX('PM 60-64'!$A$2:$E$107,J347+1,4)","v":{"$error":"#REF!"}},0,0,{"$error":"#REF!"},{"$error":"#REF!"},{"$error":"#REF!"}]
[295,{"$error":"#REF!"},{"$error":"#REF!"},{"$error":"#REF!"},{"$error":"#REF!"},{"$error":"#REF!"},{"$error":"#REF!"},{"$error":"#REF!"},{"$error":"#REF!"},{"$error":"#REF!"},{"$f":"INDEX('PM 60-64'!$A$2:$E$107,J348+1,4)","v":{"$error":"#REF!"}},0,0,{"$error":"#REF!"},{"$error":"#REF!"},{"$error":"#REF!"}]
[296,{"$error":"#REF!"},{"$error":"#REF!"},{"$error":"#REF!"},{"$error":"#REF!"},{"$error":"#REF!"},{"$error":"#REF!"},{"$error":"#REF!"},{"$error":"#REF!"},{"$error":"#REF!"},{"$f":"INDEX('PM 60-64'!$A$2:$E$107,J349+1,4)","v":{"$error":"#REF!"}},0,0,{"$error":"#REF!"},{"$error":"#REF!"},{"$error":"#REF!"}]
[297,{"$error":"#REF!"},{"$error":"#REF!"},{"$error":"#REF!"},{"$error":"#REF!"},{"$error":"#REF!"},{"$error":"#REF!"},{"$error":"#REF!"},{"$error":"#REF!"},{"$error":"#REF!"},{"$f":"INDEX('PM 60-64'!$A$2:$E$107,J350+1,4)","v":{"$error":"#REF!"}},0,0,{"$error":"#REF!"},{"$error":"#REF!"},{"$error":"#REF!"}]
[298,{"$error":"#REF!"},{"$error":"#REF!"},{"$error":"#REF!"},{"$error":"#REF!"},{"$error":"#REF!"},{"$error":"#REF!"},{"$error":"#REF!"},{"$error":"#REF!"},{"$error":"#REF!"},{"$f":"INDEX('PM 60-64'!$A$2:$E$107,J351+1,4)","v":{"$error":"#REF!"}},0,0,{"$error":"#REF!"},{"$error":"#REF!"},{"$error":"#REF!"}]
[299,{"$error":"#REF!"},{"$error":"#REF!"},{"$error":"#REF!"},{"$error":"#REF!"},{"$error":"#REF!"},{"$error":"#REF!"},{"$error":"#REF!"},{"$error":"#REF!"},{"$error":"#REF!"},{"$f":"INDEX('PM 60-64'!$A$2:$E$107,J352+1,4)","v":{"$error":"#REF!"}},0,0,{"$error":"#REF!"},{"$error":"#REF!"},{"$error":"#REF!"}]
[300,{"$error":"#REF!"},{"$error":"#REF!"},{"$error":"#REF!"},{"$error":"#REF!"},{"$error":"#REF!"},{"$error":"#REF!"},{"$error":"#REF!"},{"$error":"#REF!"},{"$error":"#REF!"},{"$f":"INDEX('PM 60-64'!$A$2:$E$107,J353+1,4)","v":{"$error":"#REF!"}},0,0,{"$error":"#REF!"},{"$error":"#REF!"},{"$error":"#REF!"}]
[301,{"$error":"#REF!"},{"$error":"#REF!"},{"$error":"#REF!"},{"$error":"#REF!"},{"$error":"#REF!"},{"$error":"#REF!"},{"$error":"#REF!"},{"$error":"#REF!"},{"$error":"#REF!"},{"$f":"INDEX('PM 60-64'!$A$2:$E$107,J354+1,4)","v":{"$error":"#REF!"}},0,0,{"$error":"#REF!"},{"$error":"#REF!"},{"$error":"#REF!"}]
[302,{"$error":"#REF!"},{"$error":"#REF!"},{"$error":"#REF!"},{"$error":"#REF!"},{"$error":"#REF!"},{"$error":"#REF!"},{"$error":"#REF!"},{"$error":"#REF!"},{"$error":"#REF!"},{"$f":"INDEX('PM 60-64'!$A$2:$E$107,J355+1,4)","v":{"$error":"#REF!"}},0,0,{"$error":"#REF!"},{"$error":"#REF!"},{"$error":"#REF!"}]
[303,{"$error":"#REF!"},{"$error":"#REF!"},{"$error":"#REF!"},{"$error":"#REF!"},{"$error":"#REF!"},{"$error":"#REF!"},{"$error":"#REF!"},{"$error":"#REF!"},{"$error":"#REF!"},{"$f":"INDEX('PM 60-64'!$A$2:$E$107,J356+1,4)","v":{"$error":"#REF!"}},0,0,{"$error":"#REF!"},{"$error":"#REF!"},{"$error":"#REF!"}]
[304,{"$error":"#REF!"},{"$error":"#REF!"},{"$error":"#REF!"},{"$error":"#REF!"},{"$error":"#REF!"},{"$error":"#REF!"},{"$error":"#REF!"},{"$error":"#REF!"},{"$error":"#REF!"},{"$f":"INDEX('PM 60-64'!$A$2:$E$107,J357+1,4)","v":{"$error":"#REF!"}},0,0,{"$error":"#REF!"},{"$error":"#REF!"},{"$error":"#REF!"}]
[305,{"$error":"#REF!"},{"$error":"#REF!"},{"$error":"#REF!"},{"$error":"#REF!"},{"$error":"#REF!"},{"$error":"#REF!"},{"$error":"#REF!"},{"$error":"#REF!"},{"$error":"#REF!"},{"$f":"INDEX('PM 60-64'!$A$2:$E$107,J358+1,4)","v":{"$error":"#REF!"}},0,0,{"$error":"#REF!"},{"$error":"#REF!"},{"$error":"#REF!"}]
[306,{"$error":"#REF!"},{"$error":"#REF!"},{"$error":"#REF!"},{"$error":"#REF!"},{"$error":"#REF!"},{"$error":"#REF!"},{"$error":"#REF!"},{"$error":"#REF!"},{"$error":"#REF!"},{"$f":"INDEX('PM 60-64'!$A$2:$E$107,J359+1,4)","v":{"$error":"#REF!"}},0,0,{"$error":"#REF!"},{"$error":"#REF!"},{"$error":"#REF!"}]
[307,{"$error":"#REF!"},{"$error":"#REF!"},{"$error":"#REF!"},{"$error":"#REF!"},{"$error":"#REF!"},{"$error":"#REF!"},{"$error":"#REF!"},{"$error":"#REF!"},{"$error":"#REF!"},{"$f":"INDEX('PM 60-64'!$A$2:$E$107,J360+1,4)","v":{"$error":"#REF!"}},0,0,{"$error":"#REF!"},{"$error":"#REF!"},{"$error":"#REF!"}]
[308,{"$error":"#REF!"},{"$error":"#REF!"},{"$error":"#REF!"},{"$error":"#REF!"},{"$error":"#REF!"},{"$error":"#REF!"},{"$error":"#REF!"},{"$error":"#REF!"},{"$error":"#REF!"},{"$f":"INDEX('PM 60-64'!$A$2:$E$107,J361+1,4)","v":{"$error":"#REF!"}},0,0,{"$error":"#REF!"},{"$error":"#REF!"},{"$error":"#REF!"}]
[309,{"$error":"#REF!"},{"$error":"#REF!"},{"$error":"#REF!"},{"$error":"#REF!"},{"$error":"#REF!"},{"$error":"#REF!"},{"$error":"#REF!"},{"$error":"#REF!"},{"$error":"#REF!"},{"$f":"INDEX('PM 60-64'!$A$2:$E$107,J362+1,4)","v":{"$error":"#REF!"}},0,0,{"$error":"#REF!"},{"$error":"#REF!"},{"$error":"#REF!"}]
[310,{"$error":"#REF!"},{"$error":"#REF!"},{"$error":"#REF!"},{"$error":"#REF!"},{"$error":"#REF!"},{"$error":"#REF!"},{"$error":"#REF!"},{"$error":"#REF!"},{"$error":"#REF!"},{"$f":"INDEX('PM 60-64'!$A$2:$E$107,J363+1,4)","v":{"$error":"#REF!"}},0,0,{"$error":"#REF!"},{"$error":"#REF!"},{"$error":"#REF!"}]
[311,{"$error":"#REF!"},{"$error":"#REF!"},{"$error":"#REF!"},{"$error":"#REF!"},{"$error":"#REF!"},{"$error":"#REF!"},{"$error":"#REF!"},{"$error":"#REF!"},{"$error":"#REF!"},{"$f":"INDEX('PM 60-64'!$A$2:$E$107,J364+1,4)","v":{"$error":"#REF!"}},0,0,{"$error":"#REF!"},{"$error":"#REF!"},{"$error":"#REF!"}]
[312,{"$error":"#REF!"},{"$error":"#REF!"},{"$error":"#REF!"},{"$error":"#REF!"},{"$error":"#REF!"},{"$error":"#REF!"},{"$error":"#REF!"},{"$error":"#REF!"},{"$error":"#REF!"},{"$f":"INDEX('PM 60-64'!$A$2:$E$107,J365+1,4)","v":{"$error":"#REF!"}},0,0,{"$error":"#REF!"},{"$error":"#REF!"},{"$error":"#REF!"}]
[313,{"$error":"#REF!"},{"$error":"#REF!"},{"$error":"#REF!"},{"$error":"#REF!"},{"$error":"#REF!"},{"$error":"#REF!"},{"$error":"#REF!"},{"$error":"#REF!"},{"$error":"#REF!"},{"$f":"INDEX('PM 60-64'!$A$2:$E$107,J366+1,4)","v":{"$error":"#REF!"}},0,0,{"$error":"#REF!"},{"$error":"#REF!"},{"$error":"#REF!"}]
[314,{"$error":"#REF!"},{"$error":"#REF!"},{"$error":"#REF!"},{"$error":"#REF!"},{"$error":"#REF!"},{"$error":"#REF!"},{"$error":"#REF!"},{"$error":"#REF!"},{"$error":"#REF!"},{"$f":"INDEX('PM 60-64'!$A$2:$E$107,J367+1,4)","v":{"$error":"#REF!"}},0,0,{"$error":"#REF!"},{"$error":"#REF!"},{"$error":"#REF!"}]
[315,{"$error":"#REF!"},{"$error":"#REF!"},{"$error":"#REF!"},{"$error":"#REF!"},{"$error":"#REF!"},{"$error":"#REF!"},{"$error":"#REF!"},{"$error":"#REF!"},{"$error":"#REF!"},{"$f":"INDEX('PM 60-64'!$A$2:$E$107,J368+1,4)","v":{"$error":"#REF!"}},0,0,{"$error":"#REF!"},{"$error":"#REF!"},{"$error":"#REF!"}]
[316,{"$error":"#REF!"},{"$error":"#REF!"},{"$error":"#REF!"},{"$error":"#REF!"},{"$error":"#REF!"},{"$error":"#REF!"},{"$error":"#REF!"},{"$error":"#REF!"},{"$error":"#REF!"},{"$f":"INDEX('PM 60-64'!$A$2:$E$107,J369+1,4)","v":{"$error":"#REF!"}},0,0,{"$error":"#REF!"},{"$error":"#REF!"},{"$error":"#REF!"}]
[317,{"$error":"#REF!"},{"$error":"#REF!"},{"$error":"#REF!"},{"$error":"#REF!"},{"$error":"#REF!"},{"$error":"#REF!"},{"$error":"#REF!"},{"$error":"#REF!"},{"$error":"#REF!"},{"$f":"INDEX('PM 60-64'!$A$2:$E$107,J370+1,4)","v":{"$error":"#REF!"}},0,0,{"$error":"#REF!"},{"$error":"#REF!"},{"$error":"#REF!"}]
[318,{"$error":"#REF!"},{"$error":"#REF!"},{"$error":"#REF!"},{"$error":"#REF!"},{"$error":"#REF!"},{"$error":"#REF!"},{"$error":"#REF!"},{"$error":"#REF!"},{"$error":"#REF!"},{"$f":"INDEX('PM 60-64'!$A$2:$E$107,J371+1,4)","v":{"$error":"#REF!"}},0,0,{"$error":"#REF!"},{"$error":"#REF!"},{"$error":"#REF!"}]
[319,{"$error":"#REF!"},{"$error":"#REF!"},{"$error":"#REF!"},{"$error":"#REF!"},{"$error":"#REF!"},{"$error":"#REF!"},{"$error":"#REF!"},{"$error":"#REF!"},{"$error":"#REF!"},{"$f":"INDEX('PM 60-64'!$A$2:$E$107,J372+1,4)","v":{"$error":"#REF!"}},0,0,{"$error":"#REF!"},{"$error":"#REF!"},{"$error":"#REF!"}]
[320,{"$error":"#REF!"},{"$error":"#REF!"},{"$error":"#REF!"},{"$error":"#REF!"},{"$error":"#REF!"},{"$error":"#REF!"},{"$error":"#REF!"},{"$error":"#REF!"},{"$error":"#REF!"},{"$f":"INDEX('PM 60-64'!$A$2:$E$107,J373+1,4)","v":{"$error":"#REF!"}},0,0,{"$error":"#REF!"},{"$error":"#REF!"},{"$error":"#REF!"}]
[321,{"$error":"#REF!"},{"$error":"#REF!"},{"$f":"$I$9","v":{"$error":"#REF!"}},{"$error":"#REF!"},{"$error":"#REF!"},{"$error":"#REF!"},{"$error":"#REF!"},{"$f":"ROUND(D374-F374-G374-H374,1)","v":{"$error":"#REF!"}},{"$error":"#REF!"},{"$f":"INDEX('PM 60-64'!$A$2:$E$107,J374+1,4)","v":{"$error":"#REF!"}},0,0,{"$f":"I374+M374","v":{"$error":"#REF!"}},{"$error":"#REF!"},{"$error":"#REF!"}]
[322,{"$error":"#REF!"},{"$f":"B375","v":{"$error":"#REF!"}},{"$error":"#REF!"},{"$error":"#REF!"},{"$f":"IF($I$8=\"O\",IF(12*(YEAR(C375)-YEAR($J$3))+MONTH(C375)-MONTH($J$3)+1>12,0,D375*$I$6*MIN($I$7,$O$3)),D375*$I$6)","v":{"$error":"#REF!"}},{"$f":"IF($M$10=\"Ppure\",ROUND((D375-F375)*$M$6/(1+$M$6+$M$7),0),ROUND(D375*$M$6,0))","v":{"$error":"#REF!"}},{"$f":"IF($M$10=\"Ppure\",ROUND((D375-F375)*$M$7/(1+$M$6+$M$7),0),ROUND(D375*$M$7,0))","v":{"$error":"#REF!"}},{"$error":"#REF!"},{"$f":"INT(YEAR(C375)-YEAR($Q$6)+$O$4+0*(MONTH(C375)-MONTH($Q$6))/12)","v":{"$error":"#REF!"}},{"$f":"INDEX('PM 60-64'!$A$2:$E$107,J375+1,4)","v":{"$error":"#REF!"}},{"$f":"IF(A375>120,0,ROUND((K375*(1+$Q$7)*(1+$C$8)^(-0.5)+$Q$10)*(1+$M$9)*$Q$9,0))","v":0},{"$f":"ROUND(-L375/12,0)","v":0},{"$error":"#REF!"},{"$error":"#REF!"},{"$f":"(O375+N375)*(1+$C$10)","v":{"$error":"#REF!"}}]
[323,{"$f":"DATE(YEAR(B375),MONTH(B375)+1,DAY(B375))","v":{"$error":"#REF!"}},{"$error":"#REF!"},{"$error":"#REF!"},{"$f":"E375+D375","v":{"$error":"#REF!"}},{"$error":"#REF!"},{"$error":"#REF!"},{"$error":"#REF!"},{"$error":"#REF!"},{"$error":"#REF!"},{"$f":"INDEX('PM 60-64'!$A$2:$E$107,J376+1,4)","v":{"$error":"#REF!"}},0,0,{"$error":"#REF!"},{"$f":"P375","v":{"$error":"#REF!"}},{"$error":"#REF!"}]
[324,{"$error":"#REF!"},{"$error":"#REF!"},{"$error":"#REF!"},{"$error":"#REF!"},{"$error":"#REF!"},{"$error":"#REF!"},{"$error":"#REF!"},{"$error":"#REF!"},{"$error":"#REF!"},{"$f":"INDEX('PM 60-64'!$A$2:$E$107,J377+1,4)","v":{"$error":"#REF!"}},0,0,{"$error":"#REF!"},{"$error":"#REF!"},{"$error":"#REF!"}]
[325,{"$error":"#REF!"},{"$error":"#REF!"},{"$error":"#REF!"},{"$error":"#REF!"},{"$error":"#REF!"},{"$error":"#REF!"},{"$error":"#REF!"},{"$error":"#REF!"},{"$error":"#REF!"},{"$f":"INDEX('PM 60-64'!$A$2:$E$107,J378+1,4)","v":{"$error":"#REF!"}},0,0,{"$error":"#REF!"},{"$error":"#REF!"},{"$error":"#REF!"}]
[326,{"$error":"#REF!"},{"$error":"#REF!"},{"$error":"#REF!"},{"$error":"#REF!"},{"$error":"#REF!"},{"$error":"#REF!"},{"$error":"#REF!"},{"$error":"#REF!"},{"$error":"#REF!"},{"$f":"INDEX('PM 60-64'!$A$2:$E$107,J379+1,4)","v":{"$error":"#REF!"}},0,0,{"$error":"#REF!"},{"$error":"#REF!"},{"$error":"#REF!"}]
[327,{"$error":"#REF!"},{"$error":"#REF!"},{"$error":"#REF!"},{"$error":"#REF!"},{"$error":"#REF!"},{"$error":"#REF!"},{"$error":"#REF!"},{"$error":"#REF!"},{"$error":"#REF!"},{"$f":"INDEX('PM 60-64'!$A$2:$E$107,J380+1,4)","v":{"$error":"#REF!"}},0,0,{"$error":"#REF!"},{"$error":"#REF!"},{"$error":"#REF!"}]
[328,{"$error":"#REF!"},{"$error":"#REF!"},{"$error":"#REF!"},{"$error":"#REF!"},{"$error":"#REF!"},{"$error":"#REF!"},{"$error":"#REF!"},{"$error":"#REF!"},{"$error":"#REF!"},{"$f":"INDEX('PM 60-64'!$A$2:$E$107,J381+1,4)","v":{"$error":"#REF!"}},0,0,{"$error":"#REF!"},{"$error":"#REF!"},{"$error":"#REF!"}]
[329,{"$error":"#REF!"},{"$error":"#REF!"},{"$error":"#REF!"},{"$error":"#REF!"},{"$error":"#REF!"},{"$error":"#REF!"},{"$error":"#REF!"},{"$error":"#REF!"},{"$error":"#REF!"},{"$f":"INDEX('PM 60-64'!$A$2:$E$107,J382+1,4)","v":{"$error":"#REF!"}},0,0,{"$error":"#REF!"},{"$error":"#REF!"},{"$error":"#REF!"}]
[330,{"$error":"#REF!"},{"$error":"#REF!"},{"$error":"#REF!"},{"$error":"#REF!"},{"$error":"#REF!"},{"$error":"#REF!"},{"$error":"#REF!"},{"$error":"#REF!"},{"$error":"#REF!"},{"$f":"INDEX('PM 60-64'!$A$2:$E$107,J383+1,4)","v":{"$error":"#REF!"}},0,0,{"$error":"#REF!"},{"$error":"#REF!"},{"$error":"#REF!"}]
[331,{"$error":"#REF!"},{"$error":"#REF!"},{"$error":"#REF!"},{"$error":"#REF!"},{"$error":"#REF!"},{"$error":"#REF!"},{"$error":"#REF!"},{"$error":"#REF!"},{"$error":"#REF!"},{"$f":"INDEX('PM 60-64'!$A$2:$E$107,J384+1,4)","v":{"$error":"#REF!"}},0,0,{"$error":"#REF!"},{"$error":"#REF!"},{"$error":"#REF!"}]
[332,{"$error":"#REF!"},{"$error":"#REF!"},{"$error":"#REF!"},{"$error":"#REF!"},{"$error":"#REF!"},{"$error":"#REF!"},{"$error":"#REF!"},{"$error":"#REF!"},{"$error":"#REF!"},{"$f":"INDEX('PM 60-64'!$A$2:$E$107,J385+1,4)","v":{"$error":"#REF!"}},0,0,{"$error":"#REF!"},{"$error":"#REF!"},{"$error":"#REF!"}]
[333,{"$error":"#REF!"},{"$error":"#REF!"},{"$error":"#REF!"},{"$error":"#REF!"},{"$error":"#REF!"},{"$error":"#REF!"},{"$error":"#REF!"},{"$error":"#REF!"},{"$error":"#REF!"},{"$f":"INDEX('PM 60-64'!$A$2:$E$107,J386+1,4)","v":{"$error":"#REF!"}},0,0,{"$error":"#REF!"},{"$error":"#REF!"},{"$error":"#REF!"}]
[334,{"$error":"#REF!"},{"$error":"#REF!"},{"$error":"#REF!"},{"$error":"#REF!"},{"$error":"#REF!"},{"$error":"#REF!"},{"$error":"#REF!"},{"$error":"#REF!"},{"$error":"#REF!"},{"$f":"INDEX('PM 60-64'!$A$2:$E$107,J387+1,4)","v":{"$error":"#REF!"}},0,0,{"$error":"#REF!"},{"$error":"#REF!"},{"$error":"#REF!"}]
[335,{"$error":"#REF!"},{"$error":"#REF!"},{"$error":"#REF!"},{"$error":"#REF!"},{"$error":"#REF!"},{"$error":"#REF!"},{"$error":"#REF!"},{"$error":"#REF!"},{"$error":"#REF!"},{"$f":"INDEX('PM 60-64'!$A$2:$E$107,J388+1,4)","v":{"$error":"#REF!"}},0,0,{"$error":"#REF!"},{"$error":"#REF!"},{"$error":"#REF!"}]
[336,{"$error":"#REF!"},{"$error":"#REF!"},{"$error":"#REF!"},{"$error":"#REF!"},{"$error":"#REF!"},{"$error":"#REF!"},{"$error":"#REF!"},{"$error":"#REF!"},{"$error":"#REF!"},{"$f":"INDEX('PM 60-64'!$A$2:$E$107,J389+1,4)","v":{"$error":"#REF!"}},0,0,{"$error":"#REF!"},{"$error":"#REF!"},{"$error":"#REF!"}]
[337,{"$error":"#REF!"},{"$error":"#REF!"},{"$error":"#REF!"},{"$error":"#REF!"},{"$error":"#REF!"},{"$error":"#REF!"},{"$error":"#REF!"},{"$error":"#REF!"},{"$error":"#REF!"},{"$f":"INDEX('PM 60-64'!$A$2:$E$107,J390+1,4)","v":{"$error":"#REF!"}},0,0,{"$error":"#REF!"},{"$error":"#REF!"},{"$error":"#REF!"}]
[338,{"$error":"#REF!"},{"$error":"#REF!"},{"$error":"#REF!"},{"$error":"#REF!"},{"$error":"#REF!"},{"$error":"#REF!"},{"$error":"#REF!"},{"$error":"#REF!"},{"$error":"#REF!"},{"$f":"INDEX('PM 60-64'!$A$2:$E$107,J391+1,4)","v":{"$error":"#REF!"}},0,0,{"$error":"#REF!"},{"$error":"#REF!"},{"$error":"#REF!"}]
[339,{"$error":"#REF!"},{"$error":"#REF!"},{"$error":"#REF!"},{"$error":"#REF!"},{"$error":"#REF!"},{"$error":"#REF!"},{"$error":"#REF!"},{"$error":"#REF!"},{"$error":"#REF!"},{"$f":"INDEX('PM 60-64'!$A$2:$E$107,J392+1,4)","v":{"$error":"#REF!"}},0,0,{"$error":"#REF!"},{"$error":"#REF!"},{"$error":"#REF!"}]
[340,{"$error":"#REF!"},{"$error":"#REF!"},{"$error":"#REF!"},{"$error":"#REF!"},{"$error":"#REF!"},{"$error":"#REF!"},{"$error":"#REF!"},{"$error":"#REF!"},{"$error":"#REF!"},{"$f":"INDEX('PM 60-64'!$A$2:$E$107,J393+1,4)","v":{"$error":"#REF!"}},0,0,{"$error":"#REF!"},{"$error":"#REF!"},{"$error":"#REF!"}]
[341,{"$error":"#REF!"},{"$error":"#REF!"},{"$error":"#REF!"},{"$error":"#REF!"},{"$error":"#REF!"},{"$error":"#REF!"},{"$error":"#REF!"},{"$error":"#REF!"},{"$error":"#REF!"},{"$f":"INDEX('PM 60-64'!$A$2:$E$107,J394+1,4)","v":{"$error":"#REF!"}},0,0,{"$error":"#REF!"},{"$error":"#REF!"},{"$error":"#REF!"}]
[342,{"$error":"#REF!"},{"$error":"#REF!"},{"$error":"#REF!"},{"$error":"#REF!"},{"$error":"#REF!"},{"$error":"#REF!"},{"$error":"#REF!"},{"$error":"#REF!"},{"$error":"#REF!"},{"$f":"INDEX('PM 60-64'!$A$2:$E$107,J395+1,4)","v":{"$error":"#REF!"}},0,0,{"$error":"#REF!"},{"$error":"#REF!"},{"$error":"#REF!"}]
[343,{"$error":"#REF!"},{"$error":"#REF!"},{"$error":"#REF!"},{"$error":"#REF!"},{"$error":"#REF!"},{"$error":"#REF!"},{"$error":"#REF!"},{"$error":"#REF!"},{"$error":"#REF!"},{"$f":"INDEX('PM 60-64'!$A$2:$E$107,J396+1,4)","v":{"$error":"#REF!"}},0,0,{"$error":"#REF!"},{"$error":"#REF!"},{"$error":"#REF!"}]
[344,{"$error":"#REF!"},{"$error":"#REF!"},{"$error":"#REF!"},{"$error":"#REF!"},{"$error":"#REF!"},{"$error":"#REF!"},{"$error":"#REF!"},{"$error":"#REF!"},{"$error":"#REF!"},{"$f":"INDEX('PM 60-64'!$A$2:$E$107,J397+1,4)","v":{"$error":"#REF!"}},0,0,{"$error":"#REF!"},{"$error":"#REF!"},{"$error":"#REF!"}]
[345,{"$error":"#REF!"},{"$error":"#REF!"},{"$error":"#REF!"},{"$error":"#REF!"},{"$error":"#REF!"},{"$error":"#REF!"},{"$error":"#REF!"},{"$error":"#REF!"},{"$error":"#REF!"},{"$f":"INDEX('PM 60-64'!$A$2:$E$107,J398+1,4)","v":{"$error":"#REF!"}},0,0,{"$error":"#REF!"},{"$error":"#REF!"},{"$error":"#REF!"}]
[346,{"$error":"#REF!"},{"$error":"#REF!"},{"$error":"#REF!"},{"$error":"#REF!"},{"$error":"#REF!"},{"$error":"#REF!"},{"$error":"#REF!"},{"$error":"#REF!"},{"$error":"#REF!"},{"$f":"INDEX('PM 60-64'!$A$2:$E$107,J399+1,4)","v":{"$error":"#REF!"}},0,0,{"$error":"#REF!"},{"$error":"#REF!"},{"$error":"#REF!"}]
[347,{"$error":"#REF!"},{"$error":"#REF!"},{"$error":"#REF!"},{"$error":"#REF!"},{"$error":"#REF!"},{"$error":"#REF!"},{"$error":"#REF!"},{"$error":"#REF!"},{"$error":"#REF!"},{"$f":"INDEX('PM 60-64'!$A$2:$E$107,J400+1,4)","v":{"$error":"#REF!"}},0,0,{"$error":"#REF!"},{"$error":"#REF!"},{"$error":"#REF!"}]
[348,{"$error":"#REF!"},{"$error":"#REF!"},{"$error":"#REF!"},{"$error":"#REF!"},{"$error":"#REF!"},{"$error":"#REF!"},{"$error":"#REF!"},{"$error":"#REF!"},{"$error":"#REF!"},{"$f":"INDEX('PM 60-64'!$A$2:$E$107,J401+1,4)","v":{"$error":"#REF!"}},0,0,{"$error":"#REF!"},{"$error":"#REF!"},{"$error":"#REF!"}]
[349,{"$error":"#REF!"},{"$error":"#REF!"},{"$error":"#REF!"},{"$error":"#REF!"},{"$error":"#REF!"},{"$error":"#REF!"},{"$error":"#REF!"},{"$error":"#REF!"},{"$error":"#REF!"},{"$f":"INDEX('PM 60-64'!$A$2:$E$107,J402+1,4)","v":{"$error":"#REF!"}},0,0,{"$error":"#REF!"},{"$error":"#REF!"},{"$error":"#REF!"}]
[350,{"$error":"#REF!"},{"$error":"#REF!"},{"$error":"#REF!"},{"$error":"#REF!"},{"$error":"#REF!"},{"$error":"#REF!"},{"$error":"#REF!"},{"$error":"#REF!"},{"$error":"#REF!"},{"$f":"INDEX('PM 60-64'!$A$2:$E$107,J403+1,4)","v":{"$error":"#REF!"}},0,0,{"$error":"#REF!"},{"$error":"#REF!"},{"$error":"#REF!"}]
[351,{"$error":"#REF!"},{"$f":"B404","v":{"$error":"#REF!"}},{"$error":"#REF!"},{"$f":"E403+D403","v":{"$error":"#REF!"}},{"$f":"IF($I$8=\"O\",IF(12*(YEAR(C404)-YEAR($J$3))+MONTH(C404)-MONTH($J$3)+1>12,0,D404*$I$6*MIN($I$7,$O$3)),D404*$I$6)","v":{"$error":"#REF!"}},{"$f":"IF($M$10=\"Ppure\",ROUND((D404-F404)*$M$6/(1+$M$6+$M$7),0),ROUND(D404*$M$6,0))","v":{"$error":"#REF!"}},{"$f":"IF($M$10=\"Ppure\",ROUND((D404-F404)*$M$7/(1+$M$6+$M$7),0),ROUND(D404*$M$7,0))","v":{"$error":"#REF!"}},{"$f":"ROUND(D404-F404-G404-H404,1)","v":{"$error":"#REF!"}},{"$f":"INT(YEAR(C404)-YEAR($Q$6)+$O$4+0*(MONTH(C404)-MONTH($Q$6))/12)","v":{"$error":"#REF!"}},{"$f":"INDEX('PM 60-64'!$A$2:$E$107,J404+1,4)","v":{"$error":"#REF!"}},{"$f":"IF(A404>120,0,ROUND((K404*(1+$Q$7)*(1+$C$8)^(-0.5)+$Q$10)*(1+$M$9)*$Q$9,0))","v":0},{"$f":"ROUND(-L404/12,0)","v":0},{"$f":"I404+M404","v":{"$error":"#REF!"}},{"$f":"P403","v":{"$error":"#REF!"}},{"$f":"(O404+N404)*(1+$C$10)","v":{"$error":"#REF!"}}]
[352,{"$error":"#REF!"},{"$error":"#REF!"},{"$error":"#REF!"},{"$error":"#REF!"},{"$error":"#REF!"},{"$error":"#REF!"},{"$error":"#REF!"},{"$error":"#REF!"},{"$error":"#REF!"},{"$f":"INDEX('PM 60-64'!$A$2:$E$107,J405+1,4)","v":{"$error":"#REF!"}},0,0,{"$error":"#REF!"},{"$error":"#REF!"},{"$error":"#REF!"}]
[353,{"$error":"#REF!"},{"$error":"#REF!"},{"$error":"#REF!"},{"$error":"#REF!"},{"$error":"#REF!"},{"$error":"#REF!"},{"$error":"#REF!"},{"$error":"#REF!"},{"$error":"#REF!"},{"$f":"INDEX('PM 60-64'!$A$2:$E$107,J406+1,4)","v":{"$error":"#REF!"}},0,0,{"$error":"#REF!"},{"$error":"#REF!"},{"$error":"#REF!"}]
[354,{"$error":"#REF!"},{"$error":"#REF!"},{"$error":"#REF!"},{"$error":"#REF!"},{"$error":"#REF!"},{"$error":"#REF!"},{"$error":"#REF!"},{"$error":"#REF!"},{"$error":"#REF!"},{"$f":"INDEX('PM 60-64'!$A$2:$E$107,J407+1,4)","v":{"$error":"#REF!"}},0,0,{"$error":"#REF!"},{"$error":"#REF!"},{"$error":"#REF!"}]
[355,{"$error":"#REF!"},{"$error":"#REF!"},{"$error":"#REF!"},{"$error":"#REF!"},{"$error":"#REF!"},{"$error":"#REF!"},{"$error":"#REF!"},{"$error":"#REF!"},{"$error":"#REF!"},{"$f":"INDEX('PM 60-64'!$A$2:$E$107,J408+1,4)","v":{"$error":"#REF!"}},0,0,{"$error":"#REF!"},{"$error":"#REF!"},{"$error":"#REF!"}]
[356,{"$error":"#REF!"},{"$error":"#REF!"},{"$error":"#REF!"},{"$error":"#REF!"},{"$error":"#REF!"},{"$error":"#REF!"},{"$error":"#REF!"},{"$error":"#REF!"},{"$error":"#REF!"},{"$f":"INDEX('PM 60-64'!$A$2:$E$107,J409+1,4)","v":{"$error":"#REF!"}},0,0,{"$error":"#REF!"},{"$error":"#REF!"},{"$error":"#REF!"}]
[357,{"$error":"#REF!"},{"$error":"#REF!"},{"$error":"#REF!"},{"$error":"#REF!"},{"$error":"#REF!"},{"$error":"#REF!"},{"$error":"#REF!"},{"$error":"#REF!"},{"$error":"#REF!"},{"$f":"INDEX('PM 60-64'!$A$2:$E$107,J410+1,4)","v":{"$error":"#REF!"}},0,0,{"$error":"#REF!"},{"$error":"#REF!"},{"$error":"#REF!"}]
[358,{"$error":"#REF!"},{"$error":"#REF!"},{"$error":"#REF!"},{"$error":"#REF!"},{"$error":"#REF!"},{"$error":"#REF!"},{"$error":"#REF!"},{"$error":"#REF!"},{"$error":"#REF!"},{"$f":"INDEX('PM 60-64'!$A$2:$E$107,J411+1,4)","v":{"$error":"#REF!"}},0,0,{"$error":"#REF!"},{"$error":"#REF!"},{"$error":"#REF!"}]
[359,{"$error":"#REF!"},{"$error":"#REF!"},{"$error":"#REF!"},{"$error":"#REF!"},{"$error":"#REF!"},{"$error":"#REF!"},{"$error":"#REF!"},{"$error":"#REF!"},{"$error":"#REF!"},{"$f":"INDEX('PM 60-64'!$A$2:$E$107,J412+1,4)","v":{"$error":"#REF!"}},0,0,{"$error":"#REF!"},{"$error":"#REF!"},{"$error":"#REF!"}]
[360,{"$error":"#REF!"},{"$error":"#REF!"},{"$error":"#REF!"},{"$error":"#REF!"},{"$error":"#REF!"},{"$error":"#REF!"},{"$error":"#REF!"},{"$error":"#REF!"},{"$error":"#REF!"},{"$f":"INDEX('PM 60-64'!$A$2:$E$107,J413+1,4)","v":{"$error":"#REF!"}},0,0,{"$error":"#REF!"},{"$error":"#REF!"},{"$error":"#REF!"}]
[361,{"$error":"#REF!"},{"$error":"#REF!"},{"$error":"#REF!"},{"$error":"#REF!"},{"$error":"#REF!"},{"$error":"#REF!"},{"$error":"#REF!"},{"$error":"#REF!"},{"$error":"#REF!"},{"$f":"INDEX('PM 60-64'!$A$2:$E$107,J414+1,4)","v":{"$error":"#REF!"}},0,0,{"$error":"#REF!"},{"$error":"#REF!"},{"$error":"#REF!"}]
[362,{"$error":"#REF!"},{"$error":"#REF!"},{"$error":"#REF!"},{"$error":"#REF!"},{"$error":"#REF!"},{"$error":"#REF!"},{"$error":"#REF!"},{"$error":"#REF!"},{"$error":"#REF!"},{"$f":"INDEX('PM 60-64'!$A$2:$E$107,J415+1,4)","v":{"$error":"#REF!"}},0,0,{"$error":"#REF!"},{"$error":"#REF!"},{"$error":"#REF!"}]
[363,{"$error":"#REF!"},{"$error":"#REF!"},{"$error":"#REF!"},{"$error":"#REF!"},{"$error":"#REF!"},{"$error":"#REF!"},{"$error":"#REF!"},{"$error":"#REF!"},{"$error":"#REF!"},{"$f":"INDEX('PM 60-64'!$A$2:$E$107,J416+1,4)","v":{"$error":"#REF!"}},0,0,{"$error":"#REF!"},{"$error":"#REF!"},{"$error":"#REF!"}]
[364,{"$error":"#REF!"},{"$error":"#REF!"},{"$error":"#REF!"},{"$error":"#REF!"},{"$error":"#REF!"},{"$error":"#REF!"},{"$error":"#REF!"},{"$error":"#REF!"},{"$error":"#REF!"},{"$f":"INDEX('PM 60-64'!$A$2:$E$107,J417+1,4)","v":{"$error":"#REF!"}},0,0,{"$error":"#REF!"},{"$error":"#REF!"},{"$error":"#REF!"}]
[365,{"$error":"#REF!"},{"$error":"#REF!"},{"$error":"#REF!"},{"$error":"#REF!"},{"$error":"#REF!"},{"$error":"#REF!"},{"$error":"#REF!"},{"$error":"#REF!"},{"$error":"#REF!"},{"$f":"INDEX('PM 60-64'!$A$2:$E$107,J418+1,4)","v":{"$error":"#REF!"}},0,0,{"$error":"#REF!"},{"$error":"#REF!"},{"$error":"#REF!"}]
[366,{"$error":"#REF!"},{"$error":"#REF!"},{"$error":"#REF!"},{"$error":"#REF!"},{"$error":"#REF!"},{"$error":"#REF!"},{"$error":"#REF!"},{"$error":"#REF!"},{"$error":"#REF!"},{"$f":"INDEX('PM 60-64'!$A$2:$E$107,J419+1,4)","v":{"$error":"#REF!"}},0,0,{"$error":"#REF!"},{"$error":"#REF!"},{"$error":"#REF!"}]
[367,{"$error":"#REF!"},{"$error":"#REF!"},{"$error":"#REF!"},{"$error":"#REF!"},{"$error":"#REF!"},{"$error":"#REF!"},{"$error":"#REF!"},{"$error":"#REF!"},{"$error":"#REF!"},{"$f":"INDEX('PM 60-64'!$A$2:$E$107,J420+1,4)","v":{"$error":"#REF!"}},0,0,{"$error":"#REF!"},{"$error":"#REF!"},{"$error":"#REF!"}]
[368,{"$error":"#REF!"},{"$error":"#REF!"},{"$error":"#REF!"},{"$error":"#REF!"},{"$error":"#REF!"},{"$error":"#REF!"},{"$error":"#REF!"},{"$error":"#REF!"},{"$error":"#REF!"},{"$f":"INDEX('PM 60-64'!$A$2:$E$107,J421+1,4)","v":{"$error":"#REF!"}},0,0,{"$error":"#REF!"},{"$error":"#REF!"},{"$error":"#REF!"}]
[369,{"$error":"#REF!"},{"$error":"#REF!"},{"$error":"#REF!"},{"$error":"#REF!"},{"$error":"#REF!"},{"$error":"#REF!"},{"$error":"#REF!"},{"$error":"#REF!"},{"$error":"#REF!"},{"$f":"INDEX('PM 60-64'!$A$2:$E$107,J422+1,4)","v":{"$error":"#REF!"}},0,0,{"$error":"#REF!"},{"$error":"#REF!"},{"$error":"#REF!"}]
[370,{"$error":"#REF!"},{"$error":"#REF!"},{"$error":"#REF!"},{"$error":"#REF!"},{"$error":"#REF!"},{"$error":"#REF!"},{"$error":"#REF!"},{"$error":"#REF!"},{"$error":"#REF!"},{"$f":"INDEX('PM 60-64'!$A$2:$E$107,J423+1,4)","v":{"$error":"#REF!"}},0,0,{"$error":"#REF!"},{"$error":"#REF!"},{"$error":"#REF!"}]
[371,{"$error":"#REF!"},{"$error":"#REF!"},{"$error":"#REF!"},{"$error":"#REF!"},{"$error":"#REF!"},{"$error":"#REF!"},{"$error":"#REF!"},{"$error":"#REF!"},{"$error":"#REF!"},{"$f":"INDEX('PM 60-64'!$A$2:$E$107,J424+1,4)","v":{"$error":"#REF!"}},0,0,{"$error":"#REF!"},{"$error":"#REF!"},{"$error":"#REF!"}]
[372,{"$error":"#REF!"},{"$error":"#REF!"},{"$error":"#REF!"},{"$error":"#REF!"},{"$error":"#REF!"},{"$error":"#REF!"},{"$error":"#REF!"},{"$error":"#REF!"},{"$error":"#REF!"},{"$f":"INDEX('PM 60-64'!$A$2:$E$107,J425+1,4)","v":{"$error":"#REF!"}},0,0,{"$error":"#REF!"},{"$error":"#REF!"},{"$error":"#REF!"}]
[373,{"$error":"#REF!"},{"$error":"#REF!"},{"$error":"#REF!"},{"$error":"#REF!"},{"$error":"#REF!"},{"$error":"#REF!"},{"$error":"#REF!"},{"$error":"#REF!"},{"$error":"#REF!"},{"$f":"INDEX('PM 60-64'!$A$2:$E$107,J426+1,4)","v":{"$error":"#REF!"}},0,0,{"$error":"#REF!"},{"$error":"#REF!"},{"$error":"#REF!"}]
[374,{"$error":"#REF!"},{"$error":"#REF!"},{"$error":"#REF!"},{"$error":"#REF!"},{"$error":"#REF!"},{"$error":"#REF!"},{"$error":"#REF!"},{"$error":"#REF!"},{"$error":"#REF!"},{"$f":"INDEX('PM 60-64'!$A$2:$E$107,J427+1,4)","v":{"$error":"#REF!"}},0,0,{"$error":"#REF!"},{"$error":"#REF!"},{"$error":"#REF!"}]
[375,{"$error":"#REF!"},{"$error":"#REF!"},{"$error":"#REF!"},{"$error":"#REF!"},{"$error":"#REF!"},{"$error":"#REF!"},{"$error":"#REF!"},{"$error":"#REF!"},{"$error":"#REF!"},{"$f":"INDEX('PM 60-64'!$A$2:$E$107,J428+1,4)","v":{"$error":"#REF!"}},0,0,{"$error":"#REF!"},{"$error":"#REF!"},{"$error":"#REF!"}]
[376,{"$error":"#REF!"},{"$error":"#REF!"},{"$error":"#REF!"},{"$error":"#REF!"},{"$error":"#REF!"},{"$error":"#REF!"},{"$error":"#REF!"},{"$error":"#REF!"},{"$error":"#REF!"},{"$f":"INDEX('PM 60-64'!$A$2:$E$107,J429+1,4)","v":{"$error":"#REF!"}},0,0,{"$error":"#REF!"},{"$error":"#REF!"},{"$error":"#REF!"}]
[377,{"$error":"#REF!"},{"$error":"#REF!"},{"$error":"#REF!"},{"$error":"#REF!"},{"$error":"#REF!"},{"$error":"#REF!"},{"$error":"#REF!"},{"$error":"#REF!"},{"$error":"#REF!"},{"$f":"INDEX('PM 60-64'!$A$2:$E$107,J430+1,4)","v":{"$error":"#REF!"}},0,0,{"$error":"#REF!"},{"$error":"#REF!"},{"$error":"#REF!"}]
[378,{"$error":"#REF!"},{"$error":"#REF!"},{"$error":"#REF!"},{"$error":"#REF!"},{"$error":"#REF!"},{"$error":"#REF!"},{"$error":"#REF!"},{"$error":"#REF!"},{"$error":"#REF!"},{"$f":"INDEX('PM 60-64'!$A$2:$E$107,J431+1,4)","v":{"$error":"#REF!"}},0,0,{"$error":"#REF!"},{"$error":"#REF!"},{"$error":"#REF!"}]
[379,{"$error":"#REF!"},{"$error":"#REF!"},{"$error":"#REF!"},{"$error":"#REF!"},{"$error":"#REF!"},{"$error":"#REF!"},{"$error":"#REF!"},{"$error":"#REF!"},{"$error":"#REF!"},{"$f":"INDEX('PM 60-64'!$A$2:$E$107,J432+1,4)","v":{"$error":"#REF!"}},0,0,{"$error":"#REF!"},{"$error":"#REF!"},{"$error":"#REF!"}]
[380,{"$error":"#REF!"},{"$error":"#REF!"},{"$error":"#REF!"},{"$error":"#REF!"},{"$error":"#REF!"},{"$error":"#REF!"},{"$error":"#REF!"},{"$error":"#REF!"},{"$error":"#REF!"},{"$f":"INDEX('PM 60-64'!$A$2:$E$107,J433+1,4)","v":{"$error":"#REF!"}},0,0,{"$error":"#REF!"},{"$error":"#REF!"},{"$error":"#REF!"}]
[381,{"$error":"#REF!"},{"$error":"#REF!"},{"$error":"#REF!"},{"$error":"#REF!"},{"$error":"#REF!"},{"$error":"#REF!"},{"$error":"#REF!"},{"$error":"#REF!"},{"$error":"#REF!"},{"$f":"INDEX('PM 60-64'!$A$2:$E$107,J434+1,4)","v":{"$error":"#REF!"}},0,0,{"$error":"#REF!"},{"$error":"#REF!"},{"$error":"#REF!"}]
[382,{"$error":"#REF!"},{"$error":"#REF!"},{"$error":"#REF!"},{"$error":"#REF!"},{"$error":"#REF!"},{"$error":"#REF!"},{"$error":"#REF!"},{"$error":"#REF!"},{"$error":"#REF!"},{"$f":"INDEX('PM 60-64'!$A$2:$E$107,J435+1,4)","v":{"$error":"#REF!"}},0,0,{"$error":"#REF!"},{"$error":"#REF!"},{"$error":"#REF!"}]
[383,{"$error":"#REF!"},{"$error":"#REF!"},{"$error":"#REF!"},{"$error":"#REF!"},{"$error":"#REF!"},{"$error":"#REF!"},{"$error":"#REF!"},{"$error":"#REF!"},{"$error":"#REF!"},{"$f":"INDEX('PM 60-64'!$A$2:$E$107,J436+1,4)","v":{"$error":"#REF!"}},0,0,{"$error":"#REF!"},{"$error":"#REF!"},{"$error":"#REF!"}]
[384,{"$error":"#REF!"},{"$error":"#REF!"},{"$error":"#REF!"},{"$error":"#REF!"},{"$error":"#REF!"},{"$error":"#REF!"},{"$error":"#REF!"},{"$error":"#REF!"},{"$error":"#REF!"},{"$f":"INDEX('PM 60-64'!$A$2:$E$107,J437+1,4)","v":{"$error":"#REF!"}},0,0,{"$error":"#REF!"},{"$error":"#REF!"},{"$error":"#REF!"}]
[385,{"$error":"#REF!"},{"$error":"#REF!"},{"$f":"$I$9","v":{"$error":"#REF!"}},{"$error":"#REF!"},{"$error":"#REF!"},{"$error":"#REF!"},{"$error":"#REF!"},{"$error":"#REF!"},{"$error":"#REF!"},{"$f":"INDEX('PM 60-64'!$A$2:$E$107,J438+1,4)","v":{"$error":"#REF!"}},0,0,{"$error":"#REF!"},{"$error":"#REF!"},{"$error":"#REF!"}]
[386,{"$error":"#REF!"},{"$error":"#REF!"},{"$error":"#REF!"},{"$error":"#REF!"},{"$error":"#REF!"},{"$error":"#REF!"},{"$error":"#REF!"},{"$error":"#REF!"},{"$error":"#REF!"},{"$f":"INDEX('PM 60-64'!$A$2:$E$107,J439+1,4)","v":{"$error":"#REF!"}},0,0,{"$error":"#REF!"},{"$error":"#REF!"},{"$error":"#REF!"}]
[387,{"$f":"DATE(YEAR(B439),MONTH(B439)+1,DAY(B439))","v":{"$error":"#REF!"}},{"$error":"#REF!"},{"$error":"#REF!"},{"$error":"#REF!"},{"$error":"#REF!"},{"$error":"#REF!"},{"$error":"#REF!"},{"$error":"#REF!"},{"$error":"#REF!"},{"$f":"INDEX('PM 60-64'!$A$2:$E$107,J440+1,4)","v":{"$error":"#REF!"}},0,0,{"$error":"#REF!"},{"$error":"#REF!"},{"$error":"#REF!"}]
[388,{"$error":"#REF!"},{"$error":"#REF!"},{"$error":"#REF!"},{"$error":"#REF!"},{"$error":"#REF!"},{"$error":"#REF!"},{"$error":"#REF!"},{"$error":"#REF!"},{"$error":"#REF!"},{"$f":"INDEX('PM 60-64'!$A$2:$E$107,J441+1,4)","v":{"$error":"#REF!"}},0,0,{"$error":"#REF!"},{"$error":"#REF!"},{"$error":"#REF!"}]
[389,{"$error":"#REF!"},{"$error":"#REF!"},{"$error":"#REF!"},{"$error":"#REF!"},{"$error":"#REF!"},{"$error":"#REF!"},{"$error":"#REF!"},{"$error":"#REF!"},{"$error":"#REF!"},{"$f":"INDEX('PM 60-64'!$A$2:$E$107,J442+1,4)","v":{"$error":"#REF!"}},0,0,{"$error":"#REF!"},{"$error":"#REF!"},{"$error":"#REF!"}]
[390,{"$error":"#REF!"},{"$error":"#REF!"},{"$error":"#REF!"},{"$error":"#REF!"},{"$error":"#REF!"},{"$error":"#REF!"},{"$error":"#REF!"},{"$error":"#REF!"},{"$error":"#REF!"},{"$f":"INDEX('PM 60-64'!$A$2:$E$107,J443+1,4)","v":{"$error":"#REF!"}},0,0,{"$error":"#REF!"},{"$error":"#REF!"},{"$error":"#REF!"}]
[391,{"$error":"#REF!"},{"$error":"#REF!"},{"$error":"#REF!"},{"$error":"#REF!"},{"$error":"#REF!"},{"$error":"#REF!"},{"$error":"#REF!"},{"$error":"#REF!"},{"$error":"#REF!"},{"$f":"INDEX('PM 60-64'!$A$2:$E$107,J444+1,4)","v":{"$error":"#REF!"}},0,0,{"$error":"#REF!"},{"$error":"#REF!"},{"$error":"#REF!"}]
[392,{"$error":"#REF!"},{"$error":"#REF!"},{"$error":"#REF!"},{"$error":"#REF!"},{"$error":"#REF!"},{"$error":"#REF!"},{"$error":"#REF!"},{"$error":"#REF!"},{"$error":"#REF!"},{"$f":"INDEX('PM 60-64'!$A$2:$E$107,J445+1,4)","v":{"$error":"#REF!"}},0,0,{"$error":"#REF!"},{"$error":"#REF!"},{"$error":"#REF!"}]
[393,{"$error":"#REF!"},{"$error":"#REF!"},{"$error":"#REF!"},{"$error":"#REF!"},{"$error":"#REF!"},{"$error":"#REF!"},{"$error":"#REF!"},{"$error":"#REF!"},{"$error":"#REF!"},{"$f":"INDEX('PM 60-64'!$A$2:$E$107,J446+1,4)","v":{"$error":"#REF!"}},0,0,{"$error":"#REF!"},{"$error":"#REF!"},{"$error":"#REF!"}]
[394,{"$error":"#REF!"},{"$error":"#REF!"},{"$error":"#REF!"},{"$error":"#REF!"},{"$error":"#REF!"},{"$error":"#REF!"},{"$error":"#REF!"},{"$error":"#REF!"},{"$error":"#REF!"},{"$f":"INDEX('PM 60-64'!$A$2:$E$107,J447+1,4)","v":{"$error":"#REF!"}},0,0,{"$error":"#REF!"},{"$error":"#REF!"},{"$error":"#REF!"}]
[395,{"$error":"#REF!"},{"$error":"#REF!"},{"$error":"#REF!"},{"$error":"#REF!"},{"$error":"#REF!"},{"$error":"#REF!"},{"$error":"#REF!"},{"$error":"#REF!"},{"$error":"#REF!"},{"$f":"INDEX('PM 60-64'!$A$2:$E$107,J448+1,4)","v":{"$error":"#REF!"}},0,0,{"$error":"#REF!"},{"$error":"#REF!"},{"$error":"#REF!"}]
[396,{"$error":"#REF!"},{"$error":"#REF!"},{"$error":"#REF!"},{"$error":"#REF!"},{"$error":"#REF!"},{"$error":"#REF!"},{"$error":"#REF!"},{"$error":"#REF!"},{"$error":"#REF!"},{"$f":"INDEX('PM 60-64'!$A$2:$E$107,J449+1,4)","v":{"$error":"#REF!"}},0,0,{"$error":"#REF!"},{"$error":"#REF!"},{"$error":"#REF!"}]
[397,{"$error":"#REF!"},{"$error":"#REF!"},{"$error":"#REF!"},{"$error":"#REF!"},{"$error":"#REF!"},{"$error":"#REF!"},{"$error":"#REF!"},{"$error":"#REF!"},{"$error":"#REF!"},{"$f":"INDEX('PM 60-64'!$A$2:$E$107,J450+1,4)","v":{"$error":"#REF!"}},0,0,{"$error":"#REF!"},{"$error":"#REF!"},{"$error":"#REF!"}]
[398,{"$error":"#REF!"},{"$error":"#REF!"},{"$error":"#REF!"},{"$error":"#REF!"},{"$error":"#REF!"},{"$error":"#REF!"},{"$error":"#REF!"},{"$error":"#REF!"},{"$error":"#REF!"},{"$f":"INDEX('PM 60-64'!$A$2:$E$107,J451+1,4)","v":{"$error":"#REF!"}},0,0,{"$error":"#REF!"},{"$error":"#REF!"},{"$error":"#REF!"}]
[399,{"$error":"#REF!"},{"$error":"#REF!"},{"$error":"#REF!"},{"$error":"#REF!"},{"$error":"#REF!"},{"$error":"#REF!"},{"$error":"#REF!"},{"$error":"#REF!"},{"$error":"#REF!"},{"$f":"INDEX('PM 60-64'!$A$2:$E$107,J452+1,4)","v":{"$error":"#REF!"}},0,0,{"$error":"#REF!"},{"$error":"#REF!"},{"$error":"#REF!"}]
[400,{"$error":"#REF!"},{"$error":"#REF!"},{"$error":"#REF!"},{"$error":"#REF!"},{"$error":"#REF!"},{"$error":"#REF!"},{"$error":"#REF!"},{"$error":"#REF!"},{"$error":"#REF!"},{"$f":"INDEX('PM 60-64'!$A$2:$E$107,J453+1,4)","v":{"$error":"#REF!"}},0,0,{"$error":"#REF!"},{"$error":"#REF!"},{"$error":"#REF!"}]
[401,{"$error":"#REF!"},{"$error":"#REF!"},{"$error":"#REF!"},{"$error":"#REF!"},{"$error":"#REF!"},{"$error":"#REF!"},{"$error":"#REF!"},{"$error":"#REF!"},{"$error":"#REF!"},{"$f":"INDEX('PM 60-64'!$A$2:$E$107,J454+1,4)","v":{"$error":"#REF!"}},0,0,{"$error":"#REF!"},{"$error":"#REF!"},{"$error":"#REF!"}]
[402,{"$error":"#REF!"},{"$error":"#REF!"},{"$error":"#REF!"},{"$error":"#REF!"},{"$error":"#REF!"},{"$error":"#REF!"},{"$error":"#REF!"},{"$error":"#REF!"},{"$error":"#REF!"},{"$f":"INDEX('PM 60-64'!$A$2:$E$107,J455+1,4)","v":{"$error":"#REF!"}},0,0,{"$error":"#REF!"},{"$error":"#REF!"},{"$error":"#REF!"}]
[403,{"$error":"#REF!"},{"$error":"#REF!"},{"$error":"#REF!"},{"$error":"#REF!"},{"$error":"#REF!"},{"$error":"#REF!"},{"$error":"#REF!"},{"$error":"#REF!"},{"$error":"#REF!"},{"$f":"INDEX('PM 60-64'!$A$2:$E$107,J456+1,4)","v":{"$error":"#REF!"}},0,0,{"$error":"#REF!"},{"$error":"#REF!"},{"$error":"#REF!"}]
[404,{"$error":"#REF!"},{"$error":"#REF!"},{"$error":"#REF!"},{"$error":"#REF!"},{"$error":"#REF!"},{"$error":"#REF!"},{"$error":"#REF!"},{"$error":"#REF!"},{"$error":"#REF!"},{"$f":"INDEX('PM 60-64'!$A$2:$E$107,J457+1,4)","v":{"$error":"#REF!"}},0,0,{"$error":"#REF!"},{"$error":"#REF!"},{"$error":"#REF!"}]
[405,{"$error":"#REF!"},{"$error":"#REF!"},{"$error":"#REF!"},{"$error":"#REF!"},{"$error":"#REF!"},{"$error":"#REF!"},{"$error":"#REF!"},{"$error":"#REF!"},{"$error":"#REF!"},{"$f":"INDEX('PM 60-64'!$A$2:$E$107,J458+1,4)","v":{"$error":"#REF!"}},0,0,{"$error":"#REF!"},{"$error":"#REF!"},{"$error":"#REF!"}]
[406,{"$error":"#REF!"},{"$error":"#REF!"},{"$error":"#REF!"},{"$error":"#REF!"},{"$error":"#REF!"},{"$error":"#REF!"},{"$error":"#REF!"},{"$error":"#REF!"},{"$error":"#REF!"},{"$f":"INDEX('PM 60-64'!$A$2:$E$107,J459+1,4)","v":{"$error":"#REF!"}},0,0,{"$error":"#REF!"},{"$error":"#REF!"},{"$error":"#REF!"}]
[407,{"$error":"#REF!"},{"$error":"#REF!"},{"$error":"#REF!"},{"$error":"#REF!"},{"$error":"#REF!"},{"$error":"#REF!"},{"$error":"#REF!"},{"$error":"#REF!"},{"$error":"#REF!"},{"$f":"INDEX('PM 60-64'!$A$2:$E$107,J460+1,4)","v":{"$error":"#REF!"}},0,0,{"$error":"#REF!"},{"$error":"#REF!"},{"$error":"#REF!"}]
[408,{"$error":"#REF!"},{"$error":"#REF!"},{"$error":"#REF!"},{"$error":"#REF!"},{"$error":"#REF!"},{"$error":"#REF!"},{"$error":"#REF!"},{"$error":"#REF!"},{"$error":"#REF!"},{"$f":"INDEX('PM 60-64'!$A$2:$E$107,J461+1,4)","v":{"$error":"#REF!"}},0,0,{"$error":"#REF!"},{"$error":"#REF!"},{"$error":"#REF!"}]
[409,{"$error":"#REF!"},{"$error":"#REF!"},{"$error":"#REF!"},{"$error":"#REF!"},{"$error":"#REF!"},{"$error":"#REF!"},{"$error":"#REF!"},{"$error":"#REF!"},{"$error":"#REF!"},{"$f":"INDEX('PM 60-64'!$A$2:$E$107,J462+1,4)","v":{"$error":"#REF!"}},0,0,{"$error":"#REF!"},{"$error":"#REF!"},{"$error":"#REF!"}]
[410,{"$error":"#REF!"},{"$error":"#REF!"},{"$error":"#REF!"},{"$error":"#REF!"},{"$error":"#REF!"},{"$error":"#REF!"},{"$error":"#REF!"},{"$error":"#REF!"},{"$error":"#REF!"},{"$f":"INDEX('PM 60-64'!$A$2:$E$107,J463+1,4)","v":{"$error":"#REF!"}},0,0,{"$error":"#REF!"},{"$error":"#REF!"},{"$error":"#REF!"}]
[411,{"$error":"#REF!"},{"$error":"#REF!"},{"$error":"#REF!"},{"$error":"#REF!"},{"$error":"#REF!"},{"$error":"#REF!"},{"$error":"#REF!"},{"$error":"#REF!"},{"$error":"#REF!"},{"$f":"INDEX('PM 60-64'!$A$2:$E$107,J464+1,4)","v":{"$error":"#REF!"}},0,0,{"$error":"#REF!"},{"$error":"#REF!"},{"$error":"#REF!"}]
[412,{"$error":"#REF!"},{"$error":"#REF!"},{"$error":"#REF!"},{"$error":"#REF!"},{"$error":"#REF!"},{"$error":"#REF!"},{"$error":"#REF!"},{"$error":"#REF!"},{"$error":"#REF!"},{"$f":"INDEX('PM 60-64'!$A$2:$E$107,J465+1,4)","v":{"$error":"#REF!"}},0,0,{"$error":"#REF!"},{"$error":"#REF!"},{"$error":"#REF!"}]
[413,{"$error":"#REF!"},{"$error":"#REF!"},{"$error":"#REF!"},{"$error":"#REF!"},{"$error":"#REF!"},{"$error":"#REF!"},{"$error":"#REF!"},{"$error":"#REF!"},{"$error":"#REF!"},{"$f":"INDEX('PM 60-64'!$A$2:$E$107,J466+1,4)","v":{"$error":"#REF!"}},0,0,{"$error":"#REF!"},{"$error":"#REF!"},{"$error":"#REF!"}]
[414,{"$error":"#REF!"},{"$error":"#REF!"},{"$error":"#REF!"},{"$error":"#REF!"},{"$error":"#REF!"},{"$error":"#REF!"},{"$error":"#REF!"},{"$error":"#REF!"},{"$error":"#REF!"},{"$f":"INDEX('PM 60-64'!$A$2:$E$107,J467+1,4)","v":{"$error":"#REF!"}},0,0,{"$error":"#REF!"},{"$error":"#REF!"},{"$error":"#REF!"}]
[415,{"$error":"#REF!"},{"$f":"B468","v":{"$error":"#REF!"}},{"$error":"#REF!"},{"$f":"E467+D467","v":{"$error":"#REF!"}},{"$f":"IF($I$8=\"O\",IF(12*(YEAR(C468)-YEAR($J$3))+MONTH(C468)-MONTH($J$3)+1>12,0,D468*$I$6*MIN($I$7,$O$3)),D468*$I$6)","v":{"$error":"#REF!"}},{"$f":"IF($M$10=\"Ppure\",ROUND((D468-F468)*$M$6/(1+$M$6+$M$7),0),ROUND(D468*$M$6,0))","v":{"$error":"#REF!"}},{"$f":"IF($M$10=\"Ppure\",ROUND((D468-F468)*$M$7/(1+$M$6+$M$7),0),ROUND(D468*$M$7,0))","v":{"$error":"#REF!"}},{"$f":"ROUND(D468-F468-G468-H468,1)","v":{"$error":"#REF!"}},{"$f":"INT(YEAR(C468)-YEAR($Q$6)+$O$4+0*(MONTH(C468)-MONTH($Q$6))/12)","v":{"$error":"#REF!"}},{"$f":"INDEX('PM 60-64'!$A$2:$E$107,J468+1,4)","v":{"$error":"#REF!"}},{"$f":"IF(A468>120,0,ROUND((K468*(1+$Q$7)*(1+$C$8)^(-0.5)+$Q$10)*(1+$M$9)*$Q$9,0))","v":0},{"$f":"ROUND(-L468/12,0)","v":0},{"$f":"I468+M468","v":{"$error":"#REF!"}},{"$f":"P467","v":{"$error":"#REF!"}},{"$f":"(O468+N468)*(1+$C$10)","v":{"$error":"#REF!"}}]
[416,{"$error":"#REF!"},{"$error":"#REF!"},{"$error":"#REF!"},{"$error":"#REF!"},{"$error":"#REF!"},{"$error":"#REF!"},{"$error":"#REF!"},{"$error":"#REF!"},{"$error":"#REF!"},{"$f":"INDEX('PM 60-64'!$A$2:$E$107,J469+1,4)","v":{"$error":"#REF!"}},0,0,{"$error":"#REF!"},{"$error":"#REF!"},{"$error":"#REF!"}]
[417,{"$error":"#REF!"},{"$error":"#REF!"},{"$error":"#REF!"},{"$error":"#REF!"},{"$error":"#REF!"},{"$error":"#REF!"},{"$error":"#REF!"},{"$error":"#REF!"},{"$error":"#REF!"},{"$f":"INDEX('PM 60-64'!$A$2:$E$107,J470+1,4)","v":{"$error":"#REF!"}},0,0,{"$error":"#REF!"},{"$error":"#REF!"},{"$error":"#REF!"}]
[418,{"$error":"#REF!"},{"$error":"#REF!"},{"$error":"#REF!"},{"$error":"#REF!"},{"$error":"#REF!"},{"$error":"#REF!"},{"$error":"#REF!"},{"$error":"#REF!"},{"$error":"#REF!"},{"$f":"INDEX('PM 60-64'!$A$2:$E$107,J471+1,4)","v":{"$error":"#REF!"}},0,0,{"$error":"#REF!"},{"$error":"#REF!"},{"$error":"#REF!"}]
[419,{"$error":"#REF!"},{"$error":"#REF!"},{"$error":"#REF!"},{"$error":"#REF!"},{"$error":"#REF!"},{"$error":"#REF!"},{"$error":"#REF!"},{"$error":"#REF!"},{"$error":"#REF!"},{"$f":"INDEX('PM 60-64'!$A$2:$E$107,J472+1,4)","v":{"$error":"#REF!"}},0,0,{"$error":"#REF!"},{"$error":"#REF!"},{"$error":"#REF!"}]
[420,{"$error":"#REF!"},{"$error":"#REF!"},{"$error":"#REF!"},{"$error":"#REF!"},{"$error":"#REF!"},{"$error":"#REF!"},{"$error":"#REF!"},{"$error":"#REF!"},{"$error":"#REF!"},{"$f":"INDEX('PM 60-64'!$A$2:$E$107,J473+1,4)","v":{"$error":"#REF!"}},0,0,{"$error":"#REF!"},{"$error":"#REF!"},{"$error":"#REF!"}]
[421,{"$error":"#REF!"},{"$error":"#REF!"},{"$error":"#REF!"},{"$error":"#REF!"},{"$error":"#REF!"},{"$error":"#REF!"},{"$error":"#REF!"},{"$error":"#REF!"},{"$error":"#REF!"},{"$f":"INDEX('PM 60-64'!$A$2:$E$107,J474+1,4)","v":{"$error":"#REF!"}},0,0,{"$error":"#REF!"},{"$error":"#REF!"},{"$error":"#REF!"}]
[422,{"$error":"#REF!"},{"$error":"#REF!"},{"$error":"#REF!"},{"$error":"#REF!"},{"$error":"#REF!"},{"$error":"#REF!"},{"$error":"#REF!"},{"$error":"#REF!"},{"$error":"#REF!"},{"$f":"INDEX('PM 60-64'!$A$2:$E$107,J475+1,4)","v":{"$error":"#REF!"}},0,0,{"$error":"#REF!"},{"$error":"#REF!"},{"$error":"#REF!"}]
[423,{"$error":"#REF!"},{"$error":"#REF!"},{"$error":"#REF!"},{"$error":"#REF!"},{"$error":"#REF!"},{"$error":"#REF!"},{"$error":"#REF!"},{"$error":"#REF!"},{"$error":"#REF!"},{"$f":"INDEX('PM 60-64'!$A$2:$E$107,J476+1,4)","v":{"$error":"#REF!"}},0,0,{"$error":"#REF!"},{"$error":"#REF!"},{"$error":"#REF!"}]
[424,{"$error":"#REF!"},{"$error":"#REF!"},{"$error":"#REF!"},{"$error":"#REF!"},{"$error":"#REF!"},{"$error":"#REF!"},{"$error":"#REF!"},{"$error":"#REF!"},{"$error":"#REF!"},{"$f":"INDEX('PM 60-64'!$A$2:$E$107,J477+1,4)","v":{"$error":"#REF!"}},0,0,{"$error":"#REF!"},{"$error":"#REF!"},{"$error":"#REF!"}]
[425,{"$error":"#REF!"},{"$error":"#REF!"},{"$error":"#REF!"},{"$error":"#REF!"},{"$error":"#REF!"},{"$error":"#REF!"},{"$error":"#REF!"},{"$error":"#REF!"},{"$error":"#REF!"},{"$f":"INDEX('PM 60-64'!$A$2:$E$107,J478+1,4)","v":{"$error":"#REF!"}},0,0,{"$error":"#REF!"},{"$error":"#REF!"},{"$error":"#REF!"}]
[426,{"$error":"#REF!"},{"$error":"#REF!"},{"$error":"#REF!"},{"$error":"#REF!"},{"$error":"#REF!"},{"$error":"#REF!"},{"$error":"#REF!"},{"$error":"#REF!"},{"$error":"#REF!"},{"$f":"INDEX('PM 60-64'!$A$2:$E$107,J479+1,4)","v":{"$error":"#REF!"}},0,0,{"$error":"#REF!"},{"$error":"#REF!"},{"$error":"#REF!"}]
[427,{"$error":"#REF!"},{"$error":"#REF!"},{"$error":"#REF!"},{"$error":"#REF!"},{"$error":"#REF!"},{"$error":"#REF!"},{"$error":"#REF!"},{"$error":"#REF!"},{"$error":"#REF!"},{"$f":"INDEX('PM 60-64'!$A$2:$E$107,J480+1,4)","v":{"$error":"#REF!"}},0,0,{"$error":"#REF!"},{"$error":"#REF!"},{"$error":"#REF!"}]
[428,{"$error":"#REF!"},{"$error":"#REF!"},{"$error":"#REF!"},{"$error":"#REF!"},{"$error":"#REF!"},{"$error":"#REF!"},{"$error":"#REF!"},{"$error":"#REF!"},{"$error":"#REF!"},{"$f":"INDEX('PM 60-64'!$A$2:$E$107,J481+1,4)","v":{"$error":"#REF!"}},0,0,{"$error":"#REF!"},{"$error":"#REF!"},{"$error":"#REF!"}]
[429,{"$error":"#REF!"},{"$error":"#REF!"},{"$error":"#REF!"},{"$error":"#REF!"},{"$error":"#REF!"},{"$error":"#REF!"},{"$error":"#REF!"},{"$error":"#REF!"},{"$error":"#REF!"},{"$f":"INDEX('PM 60-64'!$A$2:$E$107,J482+1,4)","v":{"$error":"#REF!"}},0,0,{"$error":"#REF!"},{"$error":"#REF!"},{"$error":"#REF!"}]
[430,{"$error":"#REF!"},{"$error":"#REF!"},{"$error":"#REF!"},{"$error":"#REF!"},{"$error":"#REF!"},{"$error":"#REF!"},{"$error":"#REF!"},{"$error":"#REF!"},{"$error":"#REF!"},{"$f":"INDEX('PM 60-64'!$A$2:$E$107,J483+1,4)","v":{"$error":"#REF!"}},0,0,{"$error":"#REF!"},{"$error":"#REF!"},{"$error":"#REF!"}]
[431,{"$error":"#REF!"},{"$error":"#REF!"},{"$error":"#REF!"},{"$error":"#REF!"},{"$error":"#REF!"},{"$error":"#REF!"},{"$error":"#REF!"},{"$error":"#REF!"},{"$error":"#REF!"},{"$f":"INDEX('PM 60-64'!$A$2:$E$107,J484+1,4)","v":{"$error":"#REF!"}},0,0,{"$error":"#REF!"},{"$error":"#REF!"},{"$error":"#REF!"}]
[432,{"$error":"#REF!"},{"$error":"#REF!"},{"$error":"#REF!"},{"$error":"#REF!"},{"$error":"#REF!"},{"$error":"#REF!"},{"$error":"#REF!"},{"$error":"#REF!"},{"$error":"#REF!"},{"$f":"INDEX('PM 60-64'!$A$2:$E$107,J485+1,4)","v":{"$error":"#REF!"}},0,0,{"$error":"#REF!"},{"$error":"#REF!"},{"$error":"#REF!"}]
[433,{"$error":"#REF!"},{"$error":"#REF!"},{"$error":"#REF!"},{"$error":"#REF!"},{"$error":"#REF!"},{"$error":"#REF!"},{"$error":"#REF!"},{"$error":"#REF!"},{"$error":"#REF!"},{"$f":"INDEX('PM 60-64'!$A$2:$E$107,J486+1,4)","v":{"$error":"#REF!"}},0,0,{"$error":"#REF!"},{"$error":"#REF!"},{"$error":"#REF!"}]
[434,{"$error":"#REF!"},{"$error":"#REF!"},{"$error":"#REF!"},{"$error":"#REF!"},{"$error":"#REF!"},{"$error":"#REF!"},{"$error":"#REF!"},{"$error":"#REF!"},{"$error":"#REF!"},{"$f":"INDEX('PM 60-64'!$A$2:$E$107,J487+1,4)","v":{"$error":"#REF!"}},0,0,{"$error":"#REF!"},{"$error":"#REF!"},{"$error":"#REF!"}]
[435,{"$error":"#REF!"},{"$error":"#REF!"},{"$error":"#REF!"},{"$error":"#REF!"},{"$error":"#REF!"},{"$error":"#REF!"},{"$error":"#REF!"},{"$error":"#REF!"},{"$error":"#REF!"},{"$f":"INDEX('PM 60-64'!$A$2:$E$107,J488+1,4)","v":{"$error":"#REF!"}},0,0,{"$error":"#REF!"},{"$error":"#REF!"},{"$error":"#REF!"}]
[436,{"$error":"#REF!"},{"$error":"#REF!"},{"$error":"#REF!"},{"$error":"#REF!"},{"$error":"#REF!"},{"$error":"#REF!"},{"$error":"#REF!"},{"$error":"#REF!"},{"$error":"#REF!"},{"$f":"INDEX('PM 60-64'!$A$2:$E$107,J489+1,4)","v":{"$error":"#REF!"}},0,0,{"$error":"#REF!"},{"$error":"#REF!"},{"$error":"#REF!"}]
[437,{"$error":"#REF!"},{"$error":"#REF!"},{"$error":"#REF!"},{"$error":"#REF!"},{"$error":"#REF!"},{"$error":"#REF!"},{"$error":"#REF!"},{"$error":"#REF!"},{"$error":"#REF!"},{"$f":"INDEX('PM 60-64'!$A$2:$E$107,J490+1,4)","v":{"$error":"#REF!"}},0,0,{"$error":"#REF!"},{"$error":"#REF!"},{"$error":"#REF!"}]
[438,{"$error":"#REF!"},{"$error":"#REF!"},{"$error":"#REF!"},{"$error":"#REF!"},{"$error":"#REF!"},{"$error":"#REF!"},{"$error":"#REF!"},{"$error":"#REF!"},{"$error":"#REF!"},{"$f":"INDEX('PM 60-64'!$A$2:$E$107,J491+1,4)","v":{"$error":"#REF!"}},0,0,{"$error":"#REF!"},{"$error":"#REF!"},{"$error":"#REF!"}]
[439,{"$error":"#REF!"},{"$error":"#REF!"},{"$error":"#REF!"},{"$error":"#REF!"},{"$error":"#REF!"},{"$error":"#REF!"},{"$error":"#REF!"},{"$error":"#REF!"},{"$error":"#REF!"},{"$f":"INDEX('PM 60-64'!$A$2:$E$107,J492+1,4)","v":{"$error":"#REF!"}},0,0,{"$error":"#REF!"},{"$error":"#REF!"},{"$error":"#REF!"}]
[440,{"$error":"#REF!"},{"$error":"#REF!"},{"$error":"#REF!"},{"$error":"#REF!"},{"$error":"#REF!"},{"$error":"#REF!"},{"$error":"#REF!"},{"$error":"#REF!"},{"$error":"#REF!"},{"$f":"INDEX('PM 60-64'!$A$2:$E$107,J493+1,4)","v":{"$error":"#REF!"}},0,0,{"$error":"#REF!"},{"$error":"#REF!"},{"$error":"#REF!"}]
[441,{"$error":"#REF!"},{"$error":"#REF!"},{"$error":"#REF!"},{"$error":"#REF!"},{"$error":"#REF!"},{"$error":"#REF!"},{"$error":"#REF!"},{"$error":"#REF!"},{"$error":"#REF!"},{"$f":"INDEX('PM 60-64'!$A$2:$E$107,J494+1,4)","v":{"$error":"#REF!"}},0,0,{"$error":"#REF!"},{"$error":"#REF!"},{"$error":"#REF!"}]
[442,{"$error":"#REF!"},{"$error":"#REF!"},{"$error":"#REF!"},{"$error":"#REF!"},{"$error":"#REF!"},{"$error":"#REF!"},{"$error":"#REF!"},{"$error":"#REF!"},{"$error":"#REF!"},{"$f":"INDEX('PM 60-64'!$A$2:$E$107,J495+1,4)","v":{"$error":"#REF!"}},0,0,{"$error":"#REF!"},{"$error":"#REF!"},{"$error":"#REF!"}]
[443,{"$error":"#REF!"},{"$error":"#REF!"},{"$error":"#REF!"},{"$error":"#REF!"},{"$error":"#REF!"},{"$error":"#REF!"},{"$error":"#REF!"},{"$error":"#REF!"},{"$error":"#REF!"},{"$f":"INDEX('PM 60-64'!$A$2:$E$107,J496+1,4)","v":{"$error":"#REF!"}},0,0,{"$error":"#REF!"},{"$error":"#REF!"},{"$error":"#REF!"}]
[444,{"$error":"#REF!"},{"$error":"#REF!"},{"$error":"#REF!"},{"$error":"#REF!"},{"$error":"#REF!"},{"$error":"#REF!"},{"$error":"#REF!"},{"$error":"#REF!"},{"$error":"#REF!"},{"$f":"INDEX('PM 60-64'!$A$2:$E$107,J497+1,4)","v":{"$error":"#REF!"}},0,0,{"$error":"#REF!"},{"$error":"#REF!"},{"$error":"#REF!"}]
[445,{"$error":"#REF!"},{"$error":"#REF!"},{"$error":"#REF!"},{"$error":"#REF!"},{"$error":"#REF!"},{"$error":"#REF!"},{"$error":"#REF!"},{"$error":"#REF!"},{"$error":"#REF!"},{"$f":"INDEX('PM 60-64'!$A$2:$E$107,J498+1,4)","v":{"$error":"#REF!"}},0,0,{"$error":"#REF!"},{"$error":"#REF!"},{"$error":"#REF!"}]
[446,{"$error":"#REF!"},{"$error":"#REF!"},{"$error":"#REF!"},{"$error":"#REF!"},{"$error":"#REF!"},{"$error":"#REF!"},{"$error":"#REF!"},{"$error":"#REF!"},{"$error":"#REF!"},{"$f":"INDEX('PM 60-64'!$A$2:$E$107,J499+1,4)","v":{"$error":"#REF!"}},0,0,{"$error":"#REF!"},{"$error":"#REF!"},{"$error":"#REF!"}]
[447,{"$error":"#REF!"},{"$error":"#REF!"},{"$error":"#REF!"},{"$error":"#REF!"},{"$error":"#REF!"},{"$error":"#REF!"},{"$error":"#REF!"},{"$error":"#REF!"},{"$error":"#REF!"},{"$f":"INDEX('PM 60-64'!$A$2:$E$107,J500+1,4)","v":{"$error":"#REF!"}},0,0,{"$error":"#REF!"},{"$error":"#REF!"},{"$error":"#REF!"}]
[448,{"$error":"#REF!"},{"$error":"#REF!"},{"$error":"#REF!"},{"$error":"#REF!"},{"$error":"#REF!"},{"$error":"#REF!"},{"$error":"#REF!"},{"$error":"#REF!"},{"$error":"#REF!"},{"$f":"INDEX('PM 60-64'!$A$2:$E$107,J501+1,4)","v":{"$error":"#REF!"}},0,0,{"$error":"#REF!"},{"$error":"#REF!"},{"$error":"#REF!"}]
[449,{"$error":"#REF!"},{"$error":"#REF!"},{"$f":"$I$9","v":{"$error":"#REF!"}},{"$error":"#REF!"},{"$error":"#REF!"},{"$error":"#REF!"},{"$error":"#REF!"},{"$error":"#REF!"},{"$error":"#REF!"},{"$f":"INDEX('PM 60-64'!$A$2:$E$107,J502+1,4)","v":{"$error":"#REF!"}},0,0,{"$error":"#REF!"},{"$error":"#REF!"},{"$error":"#REF!"}]
[450,{"$error":"#REF!"},{"$error":"#REF!"},{"$error":"#REF!"},{"$error":"#REF!"},{"$error":"#REF!"},{"$error":"#REF!"},{"$error":"#REF!"},{"$error":"#REF!"},{"$error":"#REF!"},{"$f":"INDEX('PM 60-64'!$A$2:$E$107,J503+1,4)","v":{"$error":"#REF!"}},0,0,{"$error":"#REF!"},{"$error":"#REF!"},{"$error":"#REF!"}]
[451,{"$f":"DATE(YEAR(B503),MONTH(B503)+1,DAY(B503))","v":{"$error":"#REF!"}},{"$error":"#REF!"},{"$error":"#REF!"},{"$error":"#REF!"},{"$error":"#REF!"},{"$error":"#REF!"},{"$error":"#REF!"},{"$error":"#REF!"},{"$error":"#REF!"},{"$f":"INDEX('PM 60-64'!$A$2:$E$107,J504+1,4)","v":{"$error":"#REF!"}},0,0,{"$error":"#REF!"},{"$error":"#REF!"},{"$error":"#REF!"}]
[452,{"$error":"#REF!"},{"$error":"#REF!"},{"$error":"#REF!"},{"$error":"#REF!"},{"$error":"#REF!"},{"$error":"#REF!"},{"$error":"#REF!"},{"$error":"#REF!"},{"$error":"#REF!"},{"$f":"INDEX('PM 60-64'!$A$2:$E$107,J505+1,4)","v":{"$error":"#REF!"}},0,0,{"$error":"#REF!"},{"$error":"#REF!"},{"$error":"#REF!"}]
[453,{"$error":"#REF!"},{"$error":"#REF!"},{"$error":"#REF!"},{"$error":"#REF!"},{"$error":"#REF!"},{"$error":"#REF!"},{"$error":"#REF!"},{"$error":"#REF!"},{"$error":"#REF!"},{"$f":"INDEX('PM 60-64'!$A$2:$E$107,J506+1,4)","v":{"$error":"#REF!"}},0,0,{"$error":"#REF!"},{"$error":"#REF!"},{"$error":"#REF!"}]
[454,{"$error":"#REF!"},{"$error":"#REF!"},{"$error":"#REF!"},{"$error":"#REF!"},{"$error":"#REF!"},{"$error":"#REF!"},{"$error":"#REF!"},{"$error":"#REF!"},{"$error":"#REF!"},{"$f":"INDEX('PM 60-64'!$A$2:$E$107,J507+1,4)","v":{"$error":"#REF!"}},0,0,{"$error":"#REF!"},{"$error":"#REF!"},{"$error":"#REF!"}]
[455,{"$error":"#REF!"},{"$error":"#REF!"},{"$error":"#REF!"},{"$error":"#REF!"},{"$error":"#REF!"},{"$error":"#REF!"},{"$error":"#REF!"},{"$error":"#REF!"},{"$error":"#REF!"},{"$f":"INDEX('PM 60-64'!$A$2:$E$107,J508+1,4)","v":{"$error":"#REF!"}},0,0,{"$error":"#REF!"},{"$error":"#REF!"},{"$error":"#REF!"}]
[456,{"$error":"#REF!"},{"$error":"#REF!"},{"$error":"#REF!"},{"$error":"#REF!"},{"$error":"#REF!"},{"$error":"#REF!"},{"$error":"#REF!"},{"$error":"#REF!"},{"$error":"#REF!"},{"$f":"INDEX('PM 60-64'!$A$2:$E$107,J509+1,4)","v":{"$error":"#REF!"}},0,0,{"$error":"#REF!"},{"$error":"#REF!"},{"$error":"#REF!"}]
[457,{"$error":"#REF!"},{"$error":"#REF!"},{"$error":"#REF!"},{"$error":"#REF!"},{"$error":"#REF!"},{"$error":"#REF!"},{"$error":"#REF!"},{"$error":"#REF!"},{"$error":"#REF!"},{"$f":"INDEX('PM 60-64'!$A$2:$E$107,J510+1,4)","v":{"$error":"#REF!"}},0,0,{"$error":"#REF!"},{"$error":"#REF!"},{"$error":"#REF!"}]
[458,{"$error":"#REF!"},{"$error":"#REF!"},{"$error":"#REF!"},{"$error":"#REF!"},{"$error":"#REF!"},{"$error":"#REF!"},{"$error":"#REF!"},{"$error":"#REF!"},{"$error":"#REF!"},{"$f":"INDEX('PM 60-64'!$A$2:$E$107,J511+1,4)","v":{"$error":"#REF!"}},0,0,{"$error":"#REF!"},{"$error":"#REF!"},{"$error":"#REF!"}]
[459,{"$error":"#REF!"},{"$error":"#REF!"},{"$error":"#REF!"},{"$error":"#REF!"},{"$error":"#REF!"},{"$error":"#REF!"},{"$error":"#REF!"},{"$error":"#REF!"},{"$error":"#REF!"},{"$f":"INDEX('PM 60-64'!$A$2:$E$107,J512+1,4)","v":{"$error":"#REF!"}},0,0,{"$error":"#REF!"},{"$error":"#REF!"},{"$error":"#REF!"}]
[460,{"$error":"#REF!"},{"$error":"#REF!"},{"$error":"#REF!"},{"$error":"#REF!"},{"$error":"#REF!"},{"$error":"#REF!"},{"$error":"#REF!"},{"$error":"#REF!"},{"$error":"#REF!"},{"$f":"INDEX('PM 60-64'!$A$2:$E$107,J513+1,4)","v":{"$error":"#REF!"}},0,0,{"$error":"#REF!"},{"$error":"#REF!"},{"$error":"#REF!"}]
[461,{"$error":"#REF!"},{"$error":"#REF!"},{"$error":"#REF!"},{"$error":"#REF!"},{"$error":"#REF!"},{"$error":"#REF!"},{"$error":"#REF!"},{"$error":"#REF!"},{"$error":"#REF!"},{"$f":"INDEX('PM 60-64'!$A$2:$E$107,J514+1,4)","v":{"$error":"#REF!"}},0,0,{"$error":"#REF!"},{"$error":"#REF!"},{"$error":"#REF!"}]
[462,{"$error":"#REF!"},{"$error":"#REF!"},{"$error":"#REF!"},{"$error":"#REF!"},{"$error":"#REF!"},{"$error":"#REF!"},{"$error":"#REF!"},{"$error":"#REF!"},{"$error":"#REF!"},{"$f":"INDEX('PM 60-64'!$A$2:$E$107,J515+1,4)","v":{"$error":"#REF!"}},0,0,{"$error":"#REF!"},{"$error":"#REF!"},{"$error":"#REF!"}]
[463,{"$error":"#REF!"},{"$error":"#REF!"},{"$error":"#REF!"},{"$error":"#REF!"},{"$error":"#REF!"},{"$error":"#REF!"},{"$error":"#REF!"},{"$error":"#REF!"},{"$error":"#REF!"},{"$f":"INDEX('PM 60-64'!$A$2:$E$107,J516+1,4)","v":{"$error":"#REF!"}},0,0,{"$error":"#REF!"},{"$error":"#REF!"},{"$error":"#REF!"}]
[464,{"$error":"#REF!"},{"$error":"#REF!"},{"$error":"#REF!"},{"$error":"#REF!"},{"$error":"#REF!"},{"$error":"#REF!"},{"$error":"#REF!"},{"$error":"#REF!"},{"$error":"#REF!"},{"$f":"INDEX('PM 60-64'!$A$2:$E$107,J517+1,4)","v":{"$error":"#REF!"}},0,0,{"$error":"#REF!"},{"$error":"#REF!"},{"$error":"#REF!"}]
[465,{"$error":"#REF!"},{"$error":"#REF!"},{"$error":"#REF!"},{"$error":"#REF!"},{"$error":"#REF!"},{"$error":"#REF!"},{"$error":"#REF!"},{"$error":"#REF!"},{"$error":"#REF!"},{"$f":"INDEX('PM 60-64'!$A$2:$E$107,J518+1,4)","v":{"$error":"#REF!"}},0,0,{"$error":"#REF!"},{"$error":"#REF!"},{"$error":"#REF!"}]
[466,{"$error":"#REF!"},{"$error":"#REF!"},{"$error":"#REF!"},{"$error":"#REF!"},{"$error":"#REF!"},{"$error":"#REF!"},{"$error":"#REF!"},{"$error":"#REF!"},{"$error":"#REF!"},{"$f":"INDEX('PM 60-64'!$A$2:$E$107,J519+1,4)","v":{"$error":"#REF!"}},0,0,{"$error":"#REF!"},{"$error":"#REF!"},{"$error":"#REF!"}]
[467,{"$error":"#REF!"},{"$error":"#REF!"},{"$error":"#REF!"},{"$error":"#REF!"},{"$error":"#REF!"},{"$error":"#REF!"},{"$error":"#REF!"},{"$error":"#REF!"},{"$error":"#REF!"},{"$f":"INDEX('PM 60-64'!$A$2:$E$107,J520+1,4)","v":{"$error":"#REF!"}},0,0,{"$error":"#REF!"},{"$error":"#REF!"},{"$error":"#REF!"}]
[468,{"$error":"#REF!"},{"$error":"#REF!"},{"$error":"#REF!"},{"$error":"#REF!"},{"$error":"#REF!"},{"$error":"#REF!"},{"$error":"#REF!"},{"$error":"#REF!"},{"$error":"#REF!"},{"$f":"INDEX('PM 60-64'!$A$2:$E$107,J521+1,4)","v":{"$error":"#REF!"}},0,0,{"$error":"#REF!"},{"$error":"#REF!"},{"$error":"#REF!"}]
[469,{"$error":"#REF!"},{"$error":"#REF!"},{"$error":"#REF!"},{"$error":"#REF!"},{"$error":"#REF!"},{"$error":"#REF!"},{"$error":"#REF!"},{"$error":"#REF!"},{"$error":"#REF!"},{"$f":"INDEX('PM 60-64'!$A$2:$E$107,J522+1,4)","v":{"$error":"#REF!"}},0,0,{"$error":"#REF!"},{"$error":"#REF!"},{"$error":"#REF!"}]
[470,{"$error":"#REF!"},{"$error":"#REF!"},{"$error":"#REF!"},{"$error":"#REF!"},{"$error":"#REF!"},{"$error":"#REF!"},{"$error":"#REF!"},{"$error":"#REF!"},{"$error":"#REF!"},{"$f":"INDEX('PM 60-64'!$A$2:$E$107,J523+1,4)","v":{"$error":"#REF!"}},0,0,{"$error":"#REF!"},{"$error":"#REF!"},{"$error":"#REF!"}]
[471,{"$error":"#REF!"},{"$error":"#REF!"},{"$error":"#REF!"},{"$error":"#REF!"},{"$error":"#REF!"},{"$error":"#REF!"},{"$error":"#REF!"},{"$error":"#REF!"},{"$error":"#REF!"},{"$f":"INDEX('PM 60-64'!$A$2:$E$107,J524+1,4)","v":{"$error":"#REF!"}},0,0,{"$error":"#REF!"},{"$error":"#REF!"},{"$error":"#REF!"}]
[472,{"$error":"#REF!"},{"$error":"#REF!"},{"$error":"#REF!"},{"$error":"#REF!"},{"$error":"#REF!"},{"$error":"#REF!"},{"$error":"#REF!"},{"$error":"#REF!"},{"$error":"#REF!"},{"$f":"INDEX('PM 60-64'!$A$2:$E$107,J525+1,4)","v":{"$error":"#REF!"}},0,0,{"$error":"#REF!"},{"$error":"#REF!"},{"$error":"#REF!"}]
[473,{"$error":"#REF!"},{"$error":"#REF!"},{"$error":"#REF!"},{"$error":"#REF!"},{"$error":"#REF!"},{"$error":"#REF!"},{"$error":"#REF!"},{"$error":"#REF!"},{"$error":"#REF!"},{"$f":"INDEX('PM 60-64'!$A$2:$E$107,J526+1,4)","v":{"$error":"#REF!"}},0,0,{"$error":"#REF!"},{"$error":"#REF!"},{"$error":"#REF!"}]
[474,{"$error":"#REF!"},{"$error":"#REF!"},{"$error":"#REF!"},{"$error":"#REF!"},{"$error":"#REF!"},{"$error":"#REF!"},{"$error":"#REF!"},{"$error":"#REF!"},{"$error":"#REF!"},{"$f":"INDEX('PM 60-64'!$A$2:$E$107,J527+1,4)","v":{"$error":"#REF!"}},0,0,{"$error":"#REF!"},{"$error":"#REF!"},{"$error":"#REF!"}]
[475,{"$error":"#REF!"},{"$error":"#REF!"},{"$error":"#REF!"},{"$error":"#REF!"},{"$error":"#REF!"},{"$error":"#REF!"},{"$error":"#REF!"},{"$error":"#REF!"},{"$error":"#REF!"},{"$f":"INDEX('PM 60-64'!$A$2:$E$107,J528+1,4)","v":{"$error":"#REF!"}},0,0,{"$error":"#REF!"},{"$error":"#REF!"},{"$error":"#REF!"}]
[476,{"$error":"#REF!"},{"$error":"#REF!"},{"$error":"#REF!"},{"$error":"#REF!"},{"$error":"#REF!"},{"$error":"#REF!"},{"$error":"#REF!"},{"$error":"#REF!"},{"$error":"#REF!"},{"$f":"INDEX('PM 60-64'!$A$2:$E$107,J529+1,4)","v":{"$error":"#REF!"}},0,0,{"$error":"#REF!"},{"$error":"#REF!"},{"$error":"#REF!"}]
[477,{"$error":"#REF!"},{"$error":"#REF!"},{"$error":"#REF!"},{"$error":"#REF!"},{"$error":"#REF!"},{"$error":"#REF!"},{"$error":"#REF!"},{"$error":"#REF!"},{"$error":"#REF!"},{"$f":"INDEX('PM 60-64'!$A$2:$E$107,J530+1,4)","v":{"$error":"#REF!"}},0,0,{"$error":"#REF!"},{"$error":"#REF!"},{"$error":"#REF!"}]
[478,{"$error":"#REF!"},{"$error":"#REF!"},{"$error":"#REF!"},{"$error":"#REF!"},{"$error":"#REF!"},{"$error":"#REF!"},{"$error":"#REF!"},{"$error":"#REF!"},{"$error":"#REF!"},{"$f":"INDEX('PM 60-64'!$A$2:$E$107,J531+1,4)","v":{"$error":"#REF!"}},0,0,{"$error":"#REF!"},{"$error":"#REF!"},{"$error":"#REF!"}]
[479,{"$error":"#REF!"},{"$f":"B532","v":{"$error":"#REF!"}},{"$error":"#REF!"},{"$f":"E531+D531","v":{"$error":"#REF!"}},{"$f":"IF($I$8=\"O\",IF(12*(YEAR(C532)-YEAR($J$3))+MONTH(C532)-MONTH($J$3)+1>12,0,D532*$I$6*MIN($I$7,$O$3)),D532*$I$6)","v":{"$error":"#REF!"}},{"$f":"IF($M$10=\"Ppure\",ROUND((D532-F532)*$M$6/(1+$M$6+$M$7),0),ROUND(D532*$M$6,0))","v":{"$error":"#REF!"}},{"$f":"IF($M$10=\"Ppure\",ROUND((D532-F532)*$M$7/(1+$M$6+$M$7),0),ROUND(D532*$M$7,0))","v":{"$error":"#REF!"}},{"$f":"ROUND(D532-F532-G532-H532,1)","v":{"$error":"#REF!"}},{"$f":"INT(YEAR(C532)-YEAR($Q$6)+$O$4+0*(MONTH(C532)-MONTH($Q$6))/12)","v":{"$error":"#REF!"}},{"$f":"INDEX('PM 60-64'!$A$2:$E$107,J532+1,4)","v":{"$error":"#REF!"}},{"$f":"IF(A532>120,0,ROUND((K532*(1+$Q$7)*(1+$C$8)^(-0.5)+$Q$10)*(1+$M$9)*$Q$9,0))","v":0},{"$f":"ROUND(-L532/12,0)","v":0},{"$f":"I532+M532","v":{"$error":"#REF!"}},{"$f":"P531","v":{"$error":"#REF!"}},{"$f":"(O532+N532)*(1+$C$10)","v":{"$error":"#REF!"}}]
[480,{"$error":"#REF!"},{"$error":"#REF!"},{"$error":"#REF!"},{"$error":"#REF!"},{"$error":"#REF!"},{"$error":"#REF!"},{"$error":"#REF!"},{"$error":"#REF!"},{"$error":"#REF!"},{"$f":"INDEX('PM 60-64'!$A$2:$E$107,J533+1,4)","v":{"$error":"#REF!"}},0,0,{"$error":"#REF!"},{"$error":"#REF!"},{"$error":"#REF!"}]
[481,{"$error":"#REF!"},{"$error":"#REF!"},{"$error":"#REF!"},{"$error":"#REF!"},{"$error":"#REF!"},{"$error":"#REF!"},{"$error":"#REF!"},{"$error":"#REF!"},{"$error":"#REF!"},{"$f":"INDEX('PM 60-64'!$A$2:$E$107,J534+1,4)","v":{"$error":"#REF!"}},0,0,{"$error":"#REF!"},{"$error":"#REF!"},{"$error":"#REF!"}]
[482,{"$error":"#REF!"},{"$error":"#REF!"},{"$error":"#REF!"},{"$error":"#REF!"},{"$error":"#REF!"},{"$error":"#REF!"},{"$error":"#REF!"},{"$error":"#REF!"},{"$error":"#REF!"},{"$f":"INDEX('PM 60-64'!$A$2:$E$107,J535+1,4)","v":{"$error":"#REF!"}},0,0,{"$error":"#REF!"},{"$error":"#REF!"},{"$error":"#REF!"}]
[483,{"$error":"#REF!"},{"$error":"#REF!"},{"$error":"#REF!"},{"$error":"#REF!"},{"$error":"#REF!"},{"$error":"#REF!"},{"$error":"#REF!"},{"$error":"#REF!"},{"$error":"#REF!"},{"$f":"INDEX('PM 60-64'!$A$2:$E$107,J536+1,4)","v":{"$error":"#REF!"}},0,0,{"$error":"#REF!"},{"$error":"#REF!"},{"$error":"#REF!"}]
[484,{"$error":"#REF!"},{"$error":"#REF!"},{"$error":"#REF!"},{"$error":"#REF!"},{"$error":"#REF!"},{"$error":"#REF!"},{"$error":"#REF!"},{"$error":"#REF!"},{"$error":"#REF!"},{"$f":"INDEX('PM 60-64'!$A$2:$E$107,J537+1,4)","v":{"$error":"#REF!"}},0,0,{"$error":"#REF!"},{"$error":"#REF!"},{"$error":"#REF!"}]
[485,{"$error":"#REF!"},{"$error":"#REF!"},{"$error":"#REF!"},{"$error":"#REF!"},{"$error":"#REF!"},{"$error":"#REF!"},{"$error":"#REF!"},{"$error":"#REF!"},{"$error":"#REF!"},{"$f":"INDEX('PM 60-64'!$A$2:$E$107,J538+1,4)","v":{"$error":"#REF!"}},0,0,{"$error":"#REF!"},{"$error":"#REF!"},{"$error":"#REF!"}]
[486,{"$error":"#REF!"},{"$error":"#REF!"},{"$error":"#REF!"},{"$error":"#REF!"},{"$error":"#REF!"},{"$error":"#REF!"},{"$error":"#REF!"},{"$error":"#REF!"},{"$error":"#REF!"},{"$f":"INDEX('PM 60-64'!$A$2:$E$107,J539+1,4)","v":{"$error":"#REF!"}},0,0,{"$error":"#REF!"},{"$error":"#REF!"},{"$error":"#REF!"}]
[487,{"$error":"#REF!"},{"$error":"#REF!"},{"$error":"#REF!"},{"$error":"#REF!"},{"$error":"#REF!"},{"$error":"#REF!"},{"$error":"#REF!"},{"$error":"#REF!"},{"$error":"#REF!"},{"$f":"INDEX('PM 60-64'!$A$2:$E$107,J540+1,4)","v":{"$error":"#REF!"}},0,0,{"$error":"#REF!"},{"$error":"#REF!"},{"$error":"#REF!"}]
[488,{"$error":"#REF!"},{"$error":"#REF!"},{"$error":"#REF!"},{"$error":"#REF!"},{"$error":"#REF!"},{"$error":"#REF!"},{"$error":"#REF!"},{"$error":"#REF!"},{"$error":"#REF!"},{"$f":"INDEX('PM 60-64'!$A$2:$E$107,J541+1,4)","v":{"$error":"#REF!"}},0,0,{"$error":"#REF!"},{"$error":"#REF!"},{"$error":"#REF!"}]
[489,{"$error":"#REF!"},{"$error":"#REF!"},{"$error":"#REF!"},{"$error":"#REF!"},{"$error":"#REF!"},{"$error":"#REF!"},{"$error":"#REF!"},{"$error":"#REF!"},{"$error":"#REF!"},{"$f":"INDEX('PM 60-64'!$A$2:$E$107,J542+1,4)","v":{"$error":"#REF!"}},0,0,{"$error":"#REF!"},{"$error":"#REF!"},{"$error":"#REF!"}]
[490,{"$error":"#REF!"},{"$error":"#REF!"},{"$error":"#REF!"},{"$error":"#REF!"},{"$error":"#REF!"},{"$error":"#REF!"},{"$error":"#REF!"},{"$error":"#REF!"},{"$error":"#REF!"},{"$f":"INDEX('PM 60-64'!$A$2:$E$107,J543+1,4)","v":{"$error":"#REF!"}},0,0,{"$error":"#REF!"},{"$error":"#REF!"},{"$error":"#REF!"}]
[491,{"$error":"#REF!"},{"$error":"#REF!"},{"$error":"#REF!"},{"$error":"#REF!"},{"$error":"#REF!"},{"$error":"#REF!"},{"$error":"#REF!"},{"$error":"#REF!"},{"$error":"#REF!"},{"$f":"INDEX('PM 60-64'!$A$2:$E$107,J544+1,4)","v":{"$error":"#REF!"}},0,0,{"$error":"#REF!"},{"$error":"#REF!"},{"$error":"#REF!"}]
[492,{"$error":"#REF!"},{"$error":"#REF!"},{"$error":"#REF!"},{"$error":"#REF!"},{"$error":"#REF!"},{"$error":"#REF!"},{"$error":"#REF!"},{"$error":"#REF!"},{"$error":"#REF!"},{"$f":"INDEX('PM 60-64'!$A$2:$E$107,J545+1,4)","v":{"$error":"#REF!"}},0,0,{"$error":"#REF!"},{"$error":"#REF!"},{"$error":"#REF!"}]
[493,{"$error":"#REF!"},{"$error":"#REF!"},{"$error":"#REF!"},{"$error":"#REF!"},{"$error":"#REF!"},{"$error":"#REF!"},{"$error":"#REF!"},{"$error":"#REF!"},{"$error":"#REF!"},{"$f":"INDEX('PM 60-64'!$A$2:$E$107,J546+1,4)","v":{"$error":"#REF!"}},0,0,{"$error":"#REF!"},{"$error":"#REF!"},{"$error":"#REF!"}]
[494,{"$error":"#REF!"},{"$error":"#REF!"},{"$error":"#REF!"},{"$error":"#REF!"},{"$error":"#REF!"},{"$error":"#REF!"},{"$error":"#REF!"},{"$error":"#REF!"},{"$error":"#REF!"},{"$f":"INDEX('PM 60-64'!$A$2:$E$107,J547+1,4)","v":{"$error":"#REF!"}},0,0,{"$error":"#REF!"},{"$error":"#REF!"},{"$error":"#REF!"}]
[495,{"$error":"#REF!"},{"$error":"#REF!"},{"$error":"#REF!"},{"$error":"#REF!"},{"$error":"#REF!"},{"$error":"#REF!"},{"$error":"#REF!"},{"$error":"#REF!"},{"$error":"#REF!"},{"$f":"INDEX('PM 60-64'!$A$2:$E$107,J548+1,4)","v":{"$error":"#REF!"}},0,0,{"$error":"#REF!"},{"$error":"#REF!"},{"$error":"#REF!"}]
[496,{"$error":"#REF!"},{"$error":"#REF!"},{"$error":"#REF!"},{"$error":"#REF!"},{"$error":"#REF!"},{"$error":"#REF!"},{"$error":"#REF!"},{"$error":"#REF!"},{"$error":"#REF!"},{"$f":"INDEX('PM 60-64'!$A$2:$E$107,J549+1,4)","v":{"$error":"#REF!"}},0,0,{"$error":"#REF!"},{"$error":"#REF!"},{"$error":"#REF!"}]
[497,{"$error":"#REF!"},{"$error":"#REF!"},{"$error":"#REF!"},{"$error":"#REF!"},{"$error":"#REF!"},{"$error":"#REF!"},{"$error":"#REF!"},{"$error":"#REF!"},{"$error":"#REF!"},{"$f":"INDEX('PM 60-64'!$A$2:$E$107,J550+1,4)","v":{"$error":"#REF!"}},0,0,{"$error":"#REF!"},{"$error":"#REF!"},{"$error":"#REF!"}]
[498,{"$error":"#REF!"},{"$error":"#REF!"},{"$error":"#REF!"},{"$error":"#REF!"},{"$error":"#REF!"},{"$error":"#REF!"},{"$error":"#REF!"},{"$error":"#REF!"},{"$error":"#REF!"},{"$f":"INDEX('PM 60-64'!$A$2:$E$107,J551+1,4)","v":{"$error":"#REF!"}},0,0,{"$error":"#REF!"},{"$error":"#REF!"},{"$error":"#REF!"}]
[499,{"$error":"#REF!"},{"$error":"#REF!"},{"$error":"#REF!"},{"$error":"#REF!"},{"$error":"#REF!"},{"$error":"#REF!"},{"$error":"#REF!"},{"$error":"#REF!"},{"$error":"#REF!"},{"$f":"INDEX('PM 60-64'!$A$2:$E$107,J552+1,4)","v":{"$error":"#REF!"}},0,0,{"$error":"#REF!"},{"$error":"#REF!"},{"$error":"#REF!"}]
[500,{"$error":"#REF!"},{"$error":"#REF!"},{"$error":"#REF!"},{"$error":"#REF!"},{"$error":"#REF!"},{"$error":"#REF!"},{"$error":"#REF!"},{"$error":"#REF!"},{"$error":"#REF!"},{"$f":"INDEX('PM 60-64'!$A$2:$E$107,J553+1,4)","v":{"$error":"#REF!"}},0,0,{"$error":"#REF!"},{"$error":"#REF!"},{"$error":"#REF!"}]
[501,{"$error":"#REF!"},{"$error":"#REF!"},{"$error":"#REF!"},{"$error":"#REF!"},{"$error":"#REF!"},{"$error":"#REF!"},{"$error":"#REF!"},{"$error":"#REF!"},{"$error":"#REF!"},{"$f":"INDEX('PM 60-64'!$A$2:$E$107,J554+1,4)","v":{"$error":"#REF!"}},0,0,{"$error":"#REF!"},{"$error":"#REF!"},{"$error":"#REF!"}]
[502,{"$error":"#REF!"},{"$error":"#REF!"},{"$error":"#REF!"},{"$error":"#REF!"},{"$error":"#REF!"},{"$error":"#REF!"},{"$error":"#REF!"},{"$error":"#REF!"},{"$error":"#REF!"},{"$f":"INDEX('PM 60-64'!$A$2:$E$107,J555+1,4)","v":{"$error":"#REF!"}},0,0,{"$error":"#REF!"},{"$error":"#REF!"},{"$error":"#REF!"}]
[503,{"$error":"#REF!"},{"$error":"#REF!"},{"$error":"#REF!"},{"$error":"#REF!"},{"$error":"#REF!"},{"$error":"#REF!"},{"$error":"#REF!"},{"$error":"#REF!"},{"$error":"#REF!"},{"$f":"INDEX('PM 60-64'!$A$2:$E$107,J556+1,4)","v":{"$error":"#REF!"}},0,0,{"$error":"#REF!"},{"$error":"#REF!"},{"$error":"#REF!"}]
[504,{"$error":"#REF!"},{"$error":"#REF!"},{"$error":"#REF!"},{"$error":"#REF!"},{"$error":"#REF!"},{"$error":"#REF!"},{"$error":"#REF!"},{"$error":"#REF!"},{"$error":"#REF!"},{"$f":"INDEX('PM 60-64'!$A$2:$E$107,J557+1,4)","v":{"$error":"#REF!"}},0,0,{"$error":"#REF!"},{"$error":"#REF!"},{"$error":"#REF!"}]
[505,{"$error":"#REF!"},{"$error":"#REF!"},{"$error":"#REF!"},{"$error":"#REF!"},{"$error":"#REF!"},{"$error":"#REF!"},{"$error":"#REF!"},{"$error":"#REF!"},{"$error":"#REF!"},{"$f":"INDEX('PM 60-64'!$A$2:$E$107,J558+1,4)","v":{"$error":"#REF!"}},0,0,{"$error":"#REF!"},{"$error":"#REF!"},{"$error":"#REF!"}]
[506,{"$error":"#REF!"},{"$error":"#REF!"},{"$error":"#REF!"},{"$error":"#REF!"},{"$error":"#REF!"},{"$error":"#REF!"},{"$error":"#REF!"},{"$error":"#REF!"},{"$error":"#REF!"},{"$f":"INDEX('PM 60-64'!$A$2:$E$107,J559+1,4)","v":{"$error":"#REF!"}},0,0,{"$error":"#REF!"},{"$error":"#REF!"},{"$error":"#REF!"}]
[507,{"$error":"#REF!"},{"$error":"#REF!"},{"$error":"#REF!"},{"$error":"#REF!"},{"$error":"#REF!"},{"$error":"#REF!"},{"$error":"#REF!"},{"$error":"#REF!"},{"$error":"#REF!"},{"$f":"INDEX('PM 60-64'!$A$2:$E$107,J560+1,4)","v":{"$error":"#REF!"}},0,0,{"$error":"#REF!"},{"$error":"#REF!"},{"$error":"#REF!"}]
[508,{"$error":"#REF!"},{"$error":"#REF!"},{"$error":"#REF!"},{"$error":"#REF!"},{"$error":"#REF!"},{"$error":"#REF!"},{"$error":"#REF!"},{"$error":"#REF!"},{"$error":"#REF!"},{"$f":"INDEX('PM 60-64'!$A$2:$E$107,J561+1,4)","v":{"$error":"#REF!"}},0,0,{"$error":"#REF!"},{"$error":"#REF!"},{"$error":"#REF!"}]
[509,{"$error":"#REF!"},{"$error":"#REF!"},{"$error":"#REF!"},{"$error":"#REF!"},{"$error":"#REF!"},{"$error":"#REF!"},{"$error":"#REF!"},{"$error":"#REF!"},{"$error":"#REF!"},{"$f":"INDEX('PM 60-64'!$A$2:$E$107,J562+1,4)","v":{"$error":"#REF!"}},0,0,{"$error":"#REF!"},{"$error":"#REF!"},{"$error":"#REF!"}]
[510,{"$error":"#REF!"},{"$error":"#REF!"},{"$error":"#REF!"},{"$error":"#REF!"},{"$error":"#REF!"},{"$error":"#REF!"},{"$error":"#REF!"},{"$error":"#REF!"},{"$error":"#REF!"},{"$f":"INDEX('PM 60-64'!$A$2:$E$107,J563+1,4)","v":{"$error":"#REF!"}},0,0,{"$error":"#REF!"},{"$error":"#REF!"},{"$error":"#REF!"}]
[511,{"$error":"#REF!"},{"$error":"#REF!"},{"$error":"#REF!"},{"$error":"#REF!"},{"$error":"#REF!"},{"$error":"#REF!"},{"$error":"#REF!"},{"$error":"#REF!"},{"$error":"#REF!"},{"$f":"INDEX('PM 60-64'!$A$2:$E$107,J564+1,4)","v":{"$error":"#REF!"}},0,0,{"$error":"#REF!"},{"$error":"#REF!"},{"$error":"#REF!"}]
[512,{"$error":"#REF!"},{"$error":"#REF!"},{"$error":"#REF!"},{"$error":"#REF!"},{"$error":"#REF!"},{"$error":"#REF!"},{"$error":"#REF!"},{"$error":"#REF!"},{"$error":"#REF!"},{"$f":"INDEX('PM 60-64'!$A$2:$E$107,J565+1,4)","v":{"$error":"#REF!"}},0,0,{"$error":"#REF!"},{"$error":"#REF!"},{"$error":"#REF!"}]
[513,{"$error":"#REF!"},{"$error":"#REF!"},{"$f":"$I$9","v":{"$error":"#REF!"}},{"$error":"#REF!"},{"$error":"#REF!"},{"$error":"#REF!"},{"$error":"#REF!"},{"$error":"#REF!"},{"$error":"#REF!"},{"$f":"INDEX('PM 60-64'!$A$2:$E$107,J566+1,4)","v":{"$error":"#REF!"}},0,0,{"$error":"#REF!"},{"$error":"#REF!"},{"$error":"#REF!"}]
[514,{"$error":"#REF!"},{"$error":"#REF!"},{"$error":"#REF!"},{"$error":"#REF!"},{"$error":"#REF!"},{"$error":"#REF!"},{"$error":"#REF!"},{"$error":"#REF!"},{"$error":"#REF!"},{"$f":"INDEX('PM 60-64'!$A$2:$E$107,J567+1,4)","v":{"$error":"#REF!"}},0,0,{"$error":"#REF!"},{"$error":"#REF!"},{"$error":"#REF!"}]
[515,{"$f":"DATE(YEAR(B567),MONTH(B567)+1,DAY(B567))","v":{"$error":"#REF!"}},{"$error":"#REF!"},{"$error":"#REF!"},{"$error":"#REF!"},{"$error":"#REF!"},{"$error":"#REF!"},{"$error":"#REF!"},{"$error":"#REF!"},{"$error":"#REF!"},{"$f":"INDEX('PM 60-64'!$A$2:$E$107,J568+1,4)","v":{"$error":"#REF!"}},0,0,{"$error":"#REF!"},{"$error":"#REF!"},{"$error":"#REF!"}]
[516,{"$error":"#REF!"},{"$error":"#REF!"},{"$error":"#REF!"},{"$error":"#REF!"},{"$error":"#REF!"},{"$error":"#REF!"},{"$error":"#REF!"},{"$error":"#REF!"},{"$error":"#REF!"},{"$f":"INDEX('PM 60-64'!$A$2:$E$107,J569+1,4)","v":{"$error":"#REF!"}},0,0,{"$error":"#REF!"},{"$error":"#REF!"},{"$error":"#REF!"}]
[517,{"$error":"#REF!"},{"$error":"#REF!"},{"$error":"#REF!"},{"$error":"#REF!"},{"$error":"#REF!"},{"$error":"#REF!"},{"$error":"#REF!"},{"$error":"#REF!"},{"$error":"#REF!"},{"$f":"INDEX('PM 60-64'!$A$2:$E$107,J570+1,4)","v":{"$error":"#REF!"}},0,0,{"$error":"#REF!"},{"$error":"#REF!"},{"$error":"#REF!"}]
[518,{"$error":"#REF!"},{"$error":"#REF!"},{"$error":"#REF!"},{"$error":"#REF!"},{"$error":"#REF!"},{"$error":"#REF!"},{"$error":"#REF!"},{"$error":"#REF!"},{"$error":"#REF!"},{"$f":"INDEX('PM 60-64'!$A$2:$E$107,J571+1,4)","v":{"$error":"#REF!"}},0,0,{"$error":"#REF!"},{"$error":"#REF!"},{"$error":"#REF!"}]
[519,{"$error":"#REF!"},{"$error":"#REF!"},{"$error":"#REF!"},{"$error":"#REF!"},{"$error":"#REF!"},{"$error":"#REF!"},{"$error":"#REF!"},{"$error":"#REF!"},{"$error":"#REF!"},{"$f":"INDEX('PM 60-64'!$A$2:$E$107,J572+1,4)","v":{"$error":"#REF!"}},0,0,{"$error":"#REF!"},{"$error":"#REF!"},{"$error":"#REF!"}]
[520,{"$error":"#REF!"},{"$error":"#REF!"},{"$error":"#REF!"},{"$error":"#REF!"},{"$error":"#REF!"},{"$error":"#REF!"},{"$error":"#REF!"},{"$error":"#REF!"},{"$error":"#REF!"},{"$f":"INDEX('PM 60-64'!$A$2:$E$107,J573+1,4)","v":{"$error":"#REF!"}},0,0,{"$error":"#REF!"},{"$error":"#REF!"},{"$error":"#REF!"}]
[521,{"$error":"#REF!"},{"$error":"#REF!"},{"$error":"#REF!"},{"$error":"#REF!"},{"$error":"#REF!"},{"$error":"#REF!"},{"$error":"#REF!"},{"$error":"#REF!"},{"$error":"#REF!"},{"$f":"INDEX('PM 60-64'!$A$2:$E$107,J574+1,4)","v":{"$error":"#REF!"}},0,0,{"$error":"#REF!"},{"$error":"#REF!"},{"$error":"#REF!"}]
[522,{"$error":"#REF!"},{"$error":"#REF!"},{"$error":"#REF!"},{"$error":"#REF!"},{"$error":"#REF!"},{"$error":"#REF!"},{"$error":"#REF!"},{"$error":"#REF!"},{"$error":"#REF!"},{"$f":"INDEX('PM 60-64'!$A$2:$E$107,J575+1,4)","v":{"$error":"#REF!"}},0,0,{"$error":"#REF!"},{"$error":"#REF!"},{"$error":"#REF!"}]
[523,{"$error":"#REF!"},{"$error":"#REF!"},{"$error":"#REF!"},{"$error":"#REF!"},{"$error":"#REF!"},{"$error":"#REF!"},{"$error":"#REF!"},{"$error":"#REF!"},{"$error":"#REF!"},{"$f":"INDEX('PM 60-64'!$A$2:$E$107,J576+1,4)","v":{"$error":"#REF!"}},0,0,{"$error":"#REF!"},{"$error":"#REF!"},{"$error":"#REF!"}]
[524,{"$error":"#REF!"},{"$error":"#REF!"},{"$error":"#REF!"},{"$error":"#REF!"},{"$error":"#REF!"},{"$error":"#REF!"},{"$error":"#REF!"},{"$error":"#REF!"},{"$error":"#REF!"},{"$f":"INDEX('PM 60-64'!$A$2:$E$107,J577+1,4)","v":{"$error":"#REF!"}},0,0,{"$error":"#REF!"},{"$error":"#REF!"},{"$error":"#REF!"}]
[525,{"$error":"#REF!"},{"$error":"#REF!"},{"$error":"#REF!"},{"$error":"#REF!"},{"$error":"#REF!"},{"$error":"#REF!"},{"$error":"#REF!"},{"$error":"#REF!"},{"$error":"#REF!"},{"$f":"INDEX('PM 60-64'!$A$2:$E$107,J578+1,4)","v":{"$error":"#REF!"}},0,0,{"$error":"#REF!"},{"$error":"#REF!"},{"$error":"#REF!"}]
[526,{"$error":"#REF!"},{"$error":"#REF!"},{"$error":"#REF!"},{"$error":"#REF!"},{"$error":"#REF!"},{"$error":"#REF!"},{"$error":"#REF!"},{"$error":"#REF!"},{"$error":"#REF!"},{"$f":"INDEX('PM 60-64'!$A$2:$E$107,J579+1,4)","v":{"$error":"#REF!"}},0,0,{"$error":"#REF!"},{"$error":"#REF!"},{"$error":"#REF!"}]
[527,{"$error":"#REF!"},{"$error":"#REF!"},{"$error":"#REF!"},{"$error":"#REF!"},{"$error":"#REF!"},{"$error":"#REF!"},{"$error":"#REF!"},{"$error":"#REF!"},{"$error":"#REF!"},{"$f":"INDEX('PM 60-64'!$A$2:$E$107,J580+1,4)","v":{"$error":"#REF!"}},0,0,{"$error":"#REF!"},{"$error":"#REF!"},{"$error":"#REF!"}]
[528,{"$error":"#REF!"},{"$error":"#REF!"},{"$error":"#REF!"},{"$error":"#REF!"},{"$error":"#REF!"},{"$error":"#REF!"},{"$error":"#REF!"},{"$error":"#REF!"},{"$error":"#REF!"},{"$f":"INDEX('PM 60-64'!$A$2:$E$107,J581+1,4)","v":{"$error":"#REF!"}},0,0,{"$error":"#REF!"},{"$error":"#REF!"},{"$error":"#REF!"}]
[529,{"$error":"#REF!"},{"$error":"#REF!"},{"$error":"#REF!"},{"$error":"#REF!"},{"$error":"#REF!"},{"$error":"#REF!"},{"$error":"#REF!"},{"$error":"#REF!"},{"$error":"#REF!"},{"$f":"INDEX('PM 60-64'!$A$2:$E$107,J582+1,4)","v":{"$error":"#REF!"}},0,0,{"$error":"#REF!"},{"$error":"#REF!"},{"$error":"#REF!"}]
[530,{"$error":"#REF!"},{"$error":"#REF!"},{"$error":"#REF!"},{"$error":"#REF!"},{"$error":"#REF!"},{"$error":"#REF!"},{"$error":"#REF!"},{"$error":"#REF!"},{"$error":"#REF!"},{"$f":"INDEX('PM 60-64'!$A$2:$E$107,J583+1,4)","v":{"$error":"#REF!"}},0,0,{"$error":"#REF!"},{"$error":"#REF!"},{"$error":"#REF!"}]
[531,{"$error":"#REF!"},{"$error":"#REF!"},{"$error":"#REF!"},{"$error":"#REF!"},{"$error":"#REF!"},{"$error":"#REF!"},{"$error":"#REF!"},{"$error":"#REF!"},{"$error":"#REF!"},{"$f":"INDEX('PM 60-64'!$A$2:$E$107,J584+1,4)","v":{"$error":"#REF!"}},0,0,{"$error":"#REF!"},{"$error":"#REF!"},{"$error":"#REF!"}]
[532,{"$error":"#REF!"},{"$error":"#REF!"},{"$error":"#REF!"},{"$error":"#REF!"},{"$error":"#REF!"},{"$error":"#REF!"},{"$error":"#REF!"},{"$error":"#REF!"},{"$error":"#REF!"},{"$f":"INDEX('PM 60-64'!$A$2:$E$107,J585+1,4)","v":{"$error":"#REF!"}},0,0,{"$error":"#REF!"},{"$error":"#REF!"},{"$error":"#REF!"}]

{"sheet":"GUIDE ","index":4,"n_rows":29,"n_cols":4,"rows_kept":29,"cut":false,"hidden":true,"merged":[[14,0,14,1],[12,0,12,1],[13,0,13,1],[1,1,2,9]]}
[]
[null,"GUIDE D'UTILISATION"]
[]
[]
["Pour l'utilisation d'outil :"]
[]
["1)  veuillez cliquer sur le bouton \"Activer les macro\"  "]
[]
["2)  veuillez cliquer sur le bouton \"EFFACER\"  dans l'onglet \"Module\""]
[]
["3) Renseigner les cellules en bleu dans l'onglet \"Module\""]
[]
["Etude présentée par :",null,"KAFUI"]
["Réalisée pour :",null,"Toto"]
["Date de la simulation (jj/mm/aaaa) :",null,"2015-03-31"]
[]
["COTISATION MENSUELLE","1909-07-31"]
[]
["DATE DE NAISSANCE","1980-12-09"]
[]
["DATE EFFET","2015-04-30"]
[]
["DATE ECHEANCE","2045-04-01"]
[]
["OPTION DECES",1,"1 pour décès","0 pour décès"]
[]
["5) Cliquer sur le bouton \"LANCER LA SIMULATION\""]
[]
["6) Dans l'onglet \"Resultat 1\" cliquer sur le bouton \"Imprimer\" qui vous permettra d'enregistrer le fichier PDF "]

{"sheet":"Module ","index":5,"n_rows":39,"n_cols":8,"rows_kept":39,"cut":false,"hidden":false,"merged":[[1,1,2,8],[6,3,6,7],[27,3,27,5],[25,3,25,5],[33,1,33,3],[11,1,11,8],[5,1,5,2],[6,1,6,2],[23,1,23,8],[5,3,5,8],[29,3,29,5]]}
[]
[null,"MODULE DE SIMULATION DU PRODUIT  NEREM"]
[]
[]
[]
[null,"Etude présentée par :",null,"ABALO BEN"]
[null,"Date de la simulation (jj/mm/aaaa) :",null,{"$f":"TODAY()","v":"2017-01-20"}]
[]
[]
[]
[]
[null,"INFORMATIONS SUR LE CLIENT  "]
[]
[null,"NOM ET PRENOMS",null,"LASSEY BEN",null,"PROFESSION",null,"CADRE DE BANQUE"]
[]
[null,"DATE DE NAISSANCE",null,"1980-12-18",null,"EMPLOYEUR",null,"GTAC2A-VIE"]
[]
[null,"LIEU DE NAISSANCE",null,"LOME",null,"ADRESSE",null,"BP/331"]
[]
[null,"TELEPHONE",null,90114488,null,"E-MAIL",null,"ben@yahoo.fr"]
[]
[]
[]
[null,"INFORMATIONS SUR LE CONTRAT"]
[]
[null,"EFFET COUVERTURE",null,"2016-12-07",null,null,null,"jj/mm/aaaa"]
[]
[null,"MONTANT MENSUEL DE LA PENSION",null,100000,null,null,null,"F CFA"]
[]
[null,"DUREE DE SERVICE DE LA PENSION ",null,36,null,null,null," MOIS"]
[]
[]
[]
[]
[null,"Duree service rente",null,"Option décès"]
[]
[null,12,null,0]
[null,24,null,1]
[null,36]

{"sheet":"calcu ","index":6,"n_rows":1035,"n_cols":12,"rows_kept":1035,"cut":false,"hidden":true,"merged":[]}
[null,null,null,"frais ",null,null,"taux ",3.5000000000000003E-2,0.04]
["age  retraite",60,null,"gest",0.11,null,null,{"$f":"(1+H1)^(1/12)-1","v":2.8708987190766422E-3},{"$f":"(1+I1)^(1/12)-1","v":3.2737397821989145E-3}]
[null,7.2700000000000004E-3,null,"acquis",0.03]
[null,null,null,"gest rente",0]
["rente ",{"$f":"'Module '!D28","v":100000}]
["duré",{"$f":"'Module '!D30","v":36},null,null,null,null,null,null,null,null,null,"Rente avec PB"]
[]
[null,"ann","mois",null,null,null,null,null,null,null,"Cpital constitif",{"$f":"VLOOKUP($C$9,$A$26:$F$1033,6,FALSE)","v":3660740.7494241116}]
["duréé contrat",{"$f":"'calcu '!$K$27-(YEAR(B18)-YEAR(B17))+5","v":24},{"$f":"B9*12","v":288}]
[null,null,null,null,null,null,null,null,null,null,"rente",{"$f":"L8/((1+E4)*(1+H2)*(1-(1+H2)^(-B6))/H2)","v":106871.50129718106}]
["captial constituf rente",null,{"$f":"B5*(1+E4)*(1+H2)*(1-(1+H2)^(-B6))/H2","v":3425366.6365597039},null,null,{"$f":"C11-E13","v":1224758.6365597039}]
[]
["prime mensuelle",null,{"$f":"ROUND(-C11/((1+H2)*(1-(1+H2)^(B9*12))/H2),0)","v":7641},null,{"$f":"C13*12*B9","v":2200608}]
[]
["Prime HT",null,{"$f":"ROUND(C13/(1-E2-E3),0)","v":8885},null,{"$f":"C15*12*B9","v":2558880},{"$f":"C11-E15","v":866486.63655970385},null,null,null,null,{"$f":"L10*E4","v":0}]
[]
["date naissance",{"$f":"'Module '!D16","v":"1980-12-18"}]
["date effet",{"$f":"'Module '!D26","v":"2016-12-07"}]
[]
[]
[]
[]
[]
[null,null,null,null,null,null,null,null,null,null,"Date min","Date max"]
["Duree","Prim HT","cumul","Pime inv","PM  à 3.5%","PM  à 4%",null,null,null,null,{"$f":"DATE(YEAR('Module '!$D$26)-K27,1,1)","v":"1961-01-01"},{"$f":"DATE(YEAR(TODAY())-18,12,31)","v":"1999-12-31"}]
[1,{"$f":"IF(A26<=$C$9,$C$15,0)","v":8885},{"$f":"B26","v":8885},{"$f":"IF(A26<=$C$9,$C$13,0)","v":7641},{"$f":"IF(A26<=$C$9,D26*(1+$H$2),0)","v":7662.936537112465},{"$f":"IF(A26<=$C$9,D26*(1+$I$2),0)","v":7666.014645675782}]
[2,{"$f":"IF(A27<=$C$9,$C$15,0)","v":8885},{"$f":"B27+C26","v":17770},{"$f":"IF(A27<=$C$9,$C$13,0)","v":7641},{"$f":"IF(A27<=$C$9,(D27+E26)*(1+$H$2),0)","v":15347.872588913693},{"$f":"IF(A27<=$C$9,(F26+D27)*(1+$I$2),0)","v":15357.125828468033},null,null,null,"age retraite",{"$f":"IF(L27=TRUE,60,55)","v":55},false]
[3,8885,{"$f":"B28+C27","v":26655},7641,{"$f":"IF(A28<=$C$9,(D28+E27)*(1+$H$2),0)","v":23054.87131378222},23073.415707908705]
[4,8885,35540,7641,30783.9960514179,30814.966712498681]
[5,8885,44425,7641,38535.310323362435,38581.861540588303]
[6,8885,53310,7641,46308.877833521459,46374.1831612608]
[7,8885,62195,7641,54104.762468688059,54192.014815218579]
[8,8885,71080,7641,61923.028299067824,62035.440015672459]
[9,8885,79965,7641,69763.739578805427,69904.542549233767]
[10,8885,88850,7641,77626.960746512676,77799.406476809396]
[11,8885,97735,7641,85512.756425798114,85720.116134499767]
[12,8885,106620,7641,93421.191425798112,93666.756134499767]
[13,8885,115505,7641,101352.33074170952,101639.41136600259]
[14,8885,124390,7641,109306.23955532379,109638.16699610653]
[15,8885,133275,7641,117282.98323556271,117663.10847072484]
[16,8885,142160,7641,125282.62733901564,125714.32151549842]
[17,8885,151045,7641,133305.23761047825,133791.89213671163]
[18,8885,159930,7641,141350.87998349284,141895.90662221104]
[19,8885,168815,7641,149419.62058089027,150026.45154232715]
[20,8885,177700,7641,157511.52571533332,158183.61375079918]
[21,8885,186585,7641,165626.66188986175,166367.48038570295]
[22,8885,195470,7641,173765.09579843876,174578.1388703816]
[23,8885,204355,7641,181926.8943264992,182815.67691437961]
[24,8885,213240,7641,190112.1245514992,191080.18251437962]
[25,8885,222125,7641,198320.85374346751,199371.74395514256]
[26,8885,231010,7641,206553.14936555829,207690.44981045066]
[27,8885,239895,7641,214809.07907460557,216036.3889440537]
[28,8885,248780,7641,223088.71072167935,224409.65051061823]
[29,8885,257665,7641,231392.11235264313,232810.32395667999]
[30,8885,266550,7641,239719.35220871324,241238.49902159936]
[31,8885,275435,7641,248070.49872701959,249694.2657385201]
[32,8885,284320,7641,256445.62054116814,258177.71443533103]
[33,8885,293205,7641,264844.78648180509,266688.93573563098]
[34,8885,302090,7641,273268.06557718228,275228.02055969677]
[35,8885,310975,7641,281715.5270537248,283795.06012545468]
[36,8885,319860,7641,290187.24033659982,292390.14594945469]
[37,8885,328745,7641,298683.27505028702,301013.36984784814]
[38,8885,337630,7641,307203.70101915096,309664.82393736858]
[39,8885,346515,7641,315748.58826801489,318344.60063631576]
[40,8885,355400,7641,324318.00702273624,327052.79266554286]
[41,8885,364285,7641,332912.02771078376,335789.49304944708]
[42,8885,373170,7641,341530.72096181632,344554.79511696321]
[43,8885,382055,7641,350174.15760826337,353348.79250256077]
[44,8885,390940,7641,358842.40868590714,362171.57914724411]
[45,8885,399825,7641,367535.54543446633,371023.24929955602]
[46,8885,408710,7641,376253.63929818175,379903.89751658449]
[47,8885,417595,7641,384996.76192640327,388813.61866497272]
[48,8885,426480,7641,393764.9851741789,397752.50792193273]
[49,8885,435365,7641,402558.38110284513,406720.66077626194]
[50,8885,444250,7641,411377.02198061935,415718.17302936321]
[51,8885,453135,7641,420220.98028319352,424745.1407962683]
[52,8885,462020,7641,429090.32869433012,433801.66050666448]
[53,8885,470905,7641,437985.14010645932,442887.82890592486]
[54,8885,479790,7641,446905.48762127804,452003.74305614165]
[55,8885,488675,7641,455851.44455035077,461149.50033716316]
[56,8885,497560,7641,464823.0844157121,470325.19844763388]
[57,8885,506445,7641,473820.4809504709,479530.9354060383]
[58,8885,515330,7641,482843.70809941634,488766.80955174787]
[59,8885,524215,7641,491892.84001962561,498032.91954607167]
[60,8885,533100,7641,500967.95108107338,507329.36437331012]
[61,8885,541985,7641,510069.11586724297,516656.24334181251]
[62,8885,550870,7641,519196.40917573927,526013.65608503786]
[63,8885,559755,7641,528349.9060189036,535401.70256261912]
[64,8885,568640,7641,537529.68162443,544820.48306143121]
[65,8885,577525,{"$f":"IF(A90<=$C$9,$C$13,0)","v":7641},546735.81143598375,554270.09819666203]
[66,{"$f":"IF(A91<=$C$9,$C$15,0)","v":8885},586410,7641,{"$f":"IF(A91<=$C$9,(D91+E90)*(1+$H$2),0)","v":555968.37111382117},{"$f":"IF(A91<=$C$9,(F90+D91)*(1+$I$2),0)","v":563750.64891288755}]
[67,8885,{"$f":"B92+C91","v":595295},7641,565227.4365354114,573262.23648514994]
[68,8885,604180,7641,574513.08379606029,582804.96252003952]
[69,8885,613065,7641,583825.38920953567,592378.92895678012]
[70,8885,621950,7641,593164.42930869421,601984.23806831811]
[71,8885,630835,7641,602530.28084611078,611620.9924624149]
[72,8885,639720,7641,611923.02079470921,621289.29508274281]
[73,8885,648605,7641,621342.72634839476,630989.24920998525]
[74,8885,657490,7641,630789.47492268845,640720.9584629396]
[75,8885,666375,7641,640263.34415536351,650484.52679962409]
[76,8885,675260,7641,649764.41190708335,660280.05851838866]
[77,8885,684145,7641,659292.7562620414,670107.65825902869]
[78,8885,693030,7641,668848.45552860305,679967.43100390316]
[79,8885,701915,7641,678431.58823994896,689859.48207905598]
[80,8885,710800,7641,688042.23315472063,699783.91715534113]
[81,8885,719685,7641,697680.46925766766,709740.84224955132]
[82,8885,728570,7641,707346.37576029671,719730.36372555082]
[83,8885,737455,7641,717040.0321015229,729752.58829541143]
[84,8885,746340,7641,726761.51794832235,739807.62302055256]
[85,8885,755225,7641,736510.91319638689,749895.57531288476]
[86,8885,764110,7641,746288.29797078087,760016.55293595733]
[87,8885,772995,7641,756093.75262659951,770170.66400610923]
[88,8885,781880,7641,765927.35774962953,780358.01699362439]
[89,8885,790765,7641,775789.19415701111,790578.72072389]
[90,8885,799650,7641,785679.34289790248,800832.88437855954]
[91,8885,808535,7641,795597.88525414548,811120.61749671854]
[92,8885,817420,7641,805544.90274093417,821442.02997605503]
[93,8885,826305,7641,815520.47710748424,831797.2320740337]
[94,8885,835190,7641,825524.69033770531,842186.33440907323]
[95,8885,844075,7641,835557.62465087441,852609.44796172832]
[96,8885,852960,7641,845619.36250231182,863066.68407587509]
[97,8885,861845,7641,855709.98658405861,873558.15445990057]
[98,8885,870730,7641,865829.57982555637,884083.97118789598]
[99,8885,879615,7641,875978.22539432871,894644.24670085392]
[100,8885,888500,7641,886156.00669666473,905239.09380786971]
[101,8885,897385,7641,896363.00737830473,915868.62568734598]
[102,8885,906270,7641,906599.31132512726,926532.9558882023]
[103,8885,915155,7641,916865.00266383879,937232.19833108759]
[104,8885,924040,7641,927160.1657626651,947966.46730959765]
[105,8885,932925,7641,937484.8852320445,958735.87749149546]
[106,8885,941810,7641,947839.24592532334,969540.54391993652]
[107,8885,950695,7641,958223.33293945342,980380.58201469772]
[108,8885,959580,7641,968637.2316156911,991256.10757341038]
[109,8885,968465,7641,979081.02754029899,1002167.2367727968]
[110,8885,977350,7641,989554.80654524919,1013114.0861699121]
[111,8885,986235,7641,1000058.6547089285,1024096.7727033885]
[112,8885,995120,7641,1010592.6583568464,1035115.4136946849]
[113,8885,1004005,7641,1021156.9040623439,1046170.1268493403]
[114,8885,1012890,7641,1031751.4786473052,1057261.0302582309]
[115,8885,1021775,7641,1042376.4691828716,1068388.2423988315]
[116,8885,1030660,7641,1053031.9629901568,1079551.882136482]
[117,8885,1039545,7641,1063718.0476409646,1090752.0687256558]
[118,8885,1048430,7641,1074434.8109585082,1101988.9218112344]
[119,8885,1057315,7641,1085182.3410181329,1113262.5614297863]
[120,8885,1066200,7641,1095960.7261480389,1124573.1080108474]
[121,8885,1075085,7641,1106770.054930008,1135920.6823782094]
[122,8885,1083970,7641,1117610.4162001314,1147305.4057512092]
[123,8885,1092855,7641,1128481.8990495396,1158727.3997460245]
[124,8885,1101740,7641,1139384.5928251345,1170186.7863769727]
[125,8885,1110625,7641,1150318.5871303242,1181683.6880578143]
[126,8885,1119510,7641,1161283.9718257592,1193218.2276030604]
[127,8885,1128395,7641,1172280.8370300704,1204790.5282292853]
[128,8885,1137280,7641,1183309.2731206105,1216400.7135564417]
[129,8885,1146165,{"$f":"IF(A154<=$C$9,$C$13,0)","v":7641},1194369.3707341964,1228048.9076091824]
[130,{"$f":"IF(A155<=$C$9,$C$15,0)","v":8885},1155050,7641,{"$f":"IF(A155<=$C$9,(D155+E154)*(1+$H$2),0)","v":1205461.220767854},{"$f":"IF(A155<=$C$9,(F154+D155)*(1+$I$2),0)","v":1239735.2348181843}]
[131,8885,{"$f":"B156+C155","v":1163935},7641,1216584.9143795655,1251459.820021478]
[132,8885,1172820,7641,1227740.5429890181,1263222.7884657816]
[133,8885,1181705,7641,1238928.1982783563,1275024.2658078379]
[134,8885,1190590,7641,1250147.972192934,1286864.3781157578]
[135,8885,1199475,7641,1261399.9569420714,1298743.2518703658]
[136,8885,1208360,7641,1272684.2449998122,1310661.013966552]
[137,8885,1217245,7641,1284000.9291056837,1322617.7917146273]
[138,8885,1226130,7641,1295350.1022654588,1334613.7128416833]
[139,8885,1235015,7641,1306731.8577519211,1346648.905492957]
[140,8885,1243900,7641,1318146.2891056302,1358723.4982331996]
[141,8885,1252785,7641,1329593.4901356916,1370837.6200480498]
[142,8885,1261670,7641,1341073.5549205272,1382991.4003454119]
[143,8885,1270555,7641,1352586.5778086486,1395184.9689568374]
[144,8885,1279440,7641,1364132.6534194322,1407418.4561389131]
[145,8885,1288325,7641,1375711.8766438973,1419691.9925746517]
[146,8885,1297210,7641,1387324.3426454852,1432005.7093748883]
[147,8885,1306095,7641,1398970.1468608424,1444359.7380796806]
[148,8885,1314980,7641,1410649.385000604,1456754.2106597142]
[149,8885,1323865,7641,1422362.153050181,1469189.2595177125]
[150,8885,1332750,7641,1434108.5472705483,1481665.0174898508]
[151,8885,1341635,7641,1445888.6641990365,1494181.6178471756]
[152,8885,1350520,7641,1457702.6006501254,1506739.194297028]
[153,8885,1359405,7641,1469550.453716239,1519337.8809844723]
[154,8885,1368290,7641,1481432.320768544,1531977.8124937287]
[155,8885,1377175,7641,1493348.2994577496,1544659.1238496113]
[156,8885,1386060,7641,1505298.4877149106,1557381.9505189701]
[157,8885,1394945,7641,1517282.9837522318,1570146.4284121385]
[158,8885,1403830,7641,1529301.8860638754,1582952.6938843846]
[159,8885,1412715,7641,1541355.2934267703,1595800.8837373685]
[160,8885,1421600,7641,1553443.3049014236,1608691.1352206036]
[161,8885,1430485,7641,1565566.0198327359,1621623.5860329217]
[162,8885,1439370,7641,1577723.537850816,1634598.3743239455]
[163,8885,1448255,7641,1589915.9588718014,1647615.6386955632]
[164,8885,1457140,7641,1602143.3830986784,1660675.5182034096]
[165,8885,1466025,7641,1614405.911022106,1673778.1523583517]
[166,8885,1474910,7641,1626703.6434212415,1686923.6811279785]
[167,8885,1483795,7641,1639036.6813645693,1700112.2449380963]
[168,8885,1492680,7641,1651405.126210731,1713343.9846742293]
[169,8885,1501565,7641,1663809.0796093585,1726619.0416831244]
[170,8885,1510450,7641,1676248.6435019094,1739937.5577742604]
[171,8885,1519335,7641,1688723.9201225054,1753299.6752213638]
[172,8885,1528220,7641,1701235.0119987717,1766705.5367639281]
[173,8885,1537105,7641,1713782.0219526798,1780155.2856087391]
[174,8885,1545990,7641,1726365.0531013929,1793649.0654314039]
[175,8885,1554875,7641,1738984.2088581128,1807187.0203778865]
[176,8885,1563760,7641,1751639.5929329304,1820769.2950660468]
[177,8885,1572645,7641,1764331.3093336781,1834396.0345871865]
[178,8885,1581530,7641,1777059.4623667835,1848067.3845075984]
[179,8885,1590415,7641,1789824.1566381278,1861783.4908701209]
[180,8885,1599300,7641,1802625.4970539052,1875544.5001956995]
[181,8885,1608185,7641,1815463.5888214845,1889350.5594849503]
[182,8885,1617070,7641,1828338.5374502749,1903201.8162197317]
[183,8885,1625955,7641,1841250.4487525919,1917098.4183647193]
[184,8885,1634840,7641,1854199.4288445273,1931040.5143689862]
[185,8885,1643725,7641,1867185.5841468221,1945028.2531675897]
[186,8885,1652610,7641,1880209.02138574,1959061.7841831611]
[187,8885,1661495,7641,1893269.8475939452,1973141.2573275028]
[188,8885,1670380,7641,1906368.1701113817,1987266.8230031896]
[189,8885,1679265,7641,1919504.0965861555,2001438.6321051749]
[190,8885,1688150,7641,1932677.7349754195,2015656.8360224033]
[191,8885,1697035,7641,1945889.1935462607,2029921.5866394269]
[192,8885,1705920,7641,1959138.5808765902,2044233.0363380285]
[193,8885,1714805,{"$f":"IF(A218<=$C$9,$C$13,0)","v":7641},1972426.0058560348,2058591.3379988493]
[194,{"$f":"IF(A219<=$C$9,$C$15,0)","v":8885},1723690,7641,{"$f":"IF(A219<=$C$9,(D219+E218)*(1+$H$2),0)","v":1985751.5776868328},{"$f":"IF(A219<=$C$9,(F218+D219)*(1+$I$2),0)","v":2072996.6450030222}]
[195,8885,{"$f":"B220+C219","v":1732575},7641,1999115.4058847309,2087449.1112338093]
[196,8885,1741460,7641,2012517.6002798842,2101948.8910782468]
[197,8885,1750345,7641,2025958.2710177593,2116496.1394287944]
[198,8885,1759230,7641,2039437.5285600394,2131091.0116849886]
[199,8885,1768115,7641,2052955.4836855317,2145733.6637551039]
[200,8885,1777000,7641,2066512.2474910782,2160424.2520578182]
[201,8885,1785885,7641,2080107.931392469,2175162.9335238831]
[202,8885,1794770,7641,2093742.6471253573,2189949.8655978004]
[203,8885,1803655,7641,2107416.506746178,2204785.2062395047]
[204,8885,1812540,7641,2121129.6226330693,2219669.1139260503]
[205,8885,1821425,7641,2134882.1074867947,2234601.7476533041]
[206,8885,1830310,7641,2148674.0743316705,2249583.2669376438]
[207,8885,1839195,7641,2162505.6365164951,2264613.8318176623]
[208,8885,1848080,7641,2176376.9077154789,2279693.6028558775]
[209,8885,1856965,7641,2190288.0019291798,2294822.7411404471]
[210,8885,1865850,7641,2204239.0334854396,2310001.4082868891]
[211,8885,1874735,7641,2218230.117040324,2325229.766439809]
[212,8885,1883620,7641,2232261.3675790648,2340507.9782746318]
[213,8885,1892505,7641,2246332.9004170042,2355836.2069993392]
[214,8885,1901390,7641,2260444.8312005438,2371214.6163562131]
[215,8885,1910275,7641,2274597.2759080934,2386643.3706235858]
[216,8885,1919160,7641,2288790.3508510254,2402122.6346175931]
[217,8885,1928045,7641,2303024.1726746312,2417652.5736939372]
[218,8885,1936930,7641,2317298.8583590779,2433233.3537496505]
[219,8885,1945815,7641,2331614.5252203713,2448865.14122487]
[220,8885,1954700,7641,2345971.2909113197,2464548.1031046137]
[221,8885,1963585,7641,2360369.2734225001,2480282.4069205658]
[222,8885,1972470,7641,2374808.5910832291,2496068.2207528655]
[223,8885,1981355,7641,2389289.3625625344,2511905.7132319026]
[224,8885,1990240,7641,2403811.7068701312,2527795.0535401185]
[225,8885,1999125,7641,2418375.7433573985,2543736.4114138144]
[226,8885,2008010,7641,2432981.5917183617,2559729.9571449636]
[227,8885,2016895,7641,2447629.3719906756,2575775.8615830312]
[228,8885,2025780,7641,2462319.2045566104,2591874.2961367993]
[229,8885,2034665,7641,2477051.2101440425,2608025.4327761969]
[230,8885,2043550,7641,2491825.5098274448,2624229.4440341387]
[231,8885,2052435,7641,2506642.2250288832,2640486.5030083666]
[232,8885,2061320,7641,2521501.4775190144,2656796.7833632999]
[233,8885,2070205,7641,2536403.389418086,2673160.4593318901]
[234,8885,2079090,7641,2551348.0831969404,2689577.7057174817]
[235,8885,2087975,7641,2566335.6816780218,2706048.6978956801]
[236,8885,2096860,7641,2581366.3080363842,2722573.6118162246]
[237,8885,2105745,7641,2596440.0858007059,2739152.6240048683]
[238,8885,2114630,7641,2611557.1388543029,2755785.9115652633]
[239,8885,2123515,7641,2626717.5914361477,2772473.6521808538]
[240,8885,2132400,7641,2641921.5681418902,2789216.0241167722]
[241,8885,2141285,7641,2657169.193924882,2806013.2062217458]
[242,8885,2150170,7641,2672460.5940972031,2822865.3779300051]
[243,8885,2159055,7641,2687795.894330692,2839772.7192632025]
[244,8885,2167940,7641,2703175.2206579777,2856735.4108323334]
[245,8885,2176825,7641,2718598.699473517,2873753.6338396673]
[246,8885,2185710,7641,2734066.4575346312,2890827.5700806826]
[247,8885,2194595,7641,2749578.6219625501,2907957.4019460091]
[248,8885,2203480,7641,2765135.3202434555,2925143.3124233754]
[249,8885,2212365,7641,2780736.6802295283,2942385.4850995648]
[250,8885,2221250,7641,2796382.8301400011,2959684.1041623754]
[251,8885,2230135,7641,2812073.8985622106,2977039.3544025891]
[252,8885,2239020,7641,2827810.0144526544,2994451.4212159445]
[253,8885,2247905,7641,2843591.3071380509,3011920.4906051168]
[254,8885,2256790,7641,2859417.9063164033,3029446.7491817065]
[255,8885,2265675,7641,2875289.9420580645,3047030.3841682314]
[256,8885,2274560,7641,2891207.5448068054,3064671.5834001275]
[257,8885,2283445,{"$f":"IF(A282<=$C$9,$C$13,0)","v":7641},2907170.8453808883,3082370.5353277549]
[258,{"$f":"IF(A283<=$C$9,$C$15,0)","v":8885},2292330,7641,{"$f":"IF(A283<=$C$9,(D283+E282)*(1+$H$2),0)","v":2923179.9749741419},{"$f":"IF(A283<=$C$9,(F282+D283)*(1+$I$2),0)","v":3100127.4290184109}]
[259,8885,{"$f":"B284+C283","v":2301215},7641,2939235.0651570382,3117942.4541583504]
[260,8885,2310100,7641,2955336.2478777752,3135815.8010548111]
[261,8885,2318985,7641,2971483.6554633607,3153747.6606380478]
[262,8885,2327870,7641,2987677.4206207003,3171738.2244633711]
[263,8885,2336755,7641,3003917.6764376871,3189787.6847131937]
[264,8885,2345640,7641,3020204.5563842962,3207896.2341990834]
[265,8885,2354525,7641,3036538.1943136817,3226064.0663638227]
[266,8885,2363410,7641,3052918.7244632766,3244291.375283476]
[267,8885,2372295,7641,3069346.2814558959,3262578.3556694621]
[268,8885,2381180,7641,3085821.0003008428,3280925.2028706339]
[269,8885,2390065,7641,3102343.0163950189,3299332.1128753661]
[270,8885,2398950,7641,3118912.465524036,3317799.2823136486]
[271,8885,2407835,7641,3135529.4838633337,3336326.9084591856]
[272,8885,2416720,7641,3152194.2079792963,3354915.1892315052]
[273,8885,2425605,7641,3168906.7748303772,3373564.3231980717]
[274,8885,2434490,7641,3185667.3217682233,3392274.5095764077]
[275,8885,2443375,7641,3202475.9865388046,3411045.9482362233]
[276,8885,2452260,7641,3219332.907283545,3429878.8397015482]
[277,8885,2461145,7641,3236238.2225404591,3448773.3851528773]
[278,8885,2470030,7641,3253192.0712452899,3467729.7864293167]
[279,8885,2478915,7641,3270194.5927326507,3486748.2460307423]
[280,8885,2487800,7641,3287245.9267371707,3505828.967119961]
[281,8885,2496685,7641,3304346.2133946428,3524972.1535248826]
[282,8885,2505570,7641,3321495.5932431757,3544178.0097406963]
[283,8885,2514455,7641,3338694.2072243486,3563446.7409320548]
[284,8885,2523340,7641,3355942.1966843698,3582778.5529352669]
[285,8885,2532225,7641,3373239.7033752385,3602173.6522604958]
[286,8885,2541110,7641,3390586.8694559094,3621632.2460939656]
[287,8885,2549995,7641,3407983.8374934611,3641154.5423001735]
[288,8885,2558880,7641,3425430.7504642676,3660740.7494241116]
[289,0,2558880,0,0,0]
[290,0,2558880,0,0,0]
[291,0,2558880,0,0,0]
[292,0,2558880,0,0,0]
[293,0,2558880,0,0,0]
[294,0,2558880,0,0,0]
[295,0,2558880,0,0,0]
[296,0,2558880,0,0,0]
[297,0,2558880,0,0,0]
[298,0,2558880,0,0,0]
[299,0,2558880,0,0,0]
[300,0,2558880,0,0,0]
[301,0,2558880,0,0,0]
[302,0,2558880,0,0,0]
[303,0,2558880,0,0,0]
[304,0,2558880,0,0,0]
[305,0,2558880,0,0,0]
[306,0,2558880,0,0,0]
[307,0,2558880,0,0,0]
[308,0,2558880,0,0,0]
[309,0,2558880,0,0,0]
[310,0,2558880,0,0,0]
[311,0,2558880,0,0,0]
[312,0,2558880,0,0,0]
[313,0,2558880,0,0,0]
[314,0,2558880,0,0,0]
[315,0,2558880,0,0,0]
[316,0,2558880,0,0,0]
[317,0,2558880,0,0,0]
[318,0,2558880,0,0,0]
[319,0,2558880,0,0,0]
[320,0,2558880,0,0,0]
[321,0,2558880,{"$f":"IF(A346<=$C$9,$C$13,0)","v":0},0,0]
[322,{"$f":"IF(A347<=$C$9,$C$15,0)","v":0},2558880,0,{"$f":"IF(A347<=$C$9,(D347+E346)*(1+$H$2),0)","v":0},{"$f":"IF(A347<=$C$9,(F346+D347)*(1+$I$2),0)","v":0}]
[323,0,{"$f":"B348+C347","v":2558880},0,0,0]
[324,0,2558880,0,0,0]
[325,0,2558880,0,0,0]
[326,0,2558880,0,0,0]
[327,0,2558880,0,0,0]
[328,0,2558880,0,0,0]
[329,0,2558880,0,0,0]
[330,0,2558880,0,0,0]
[331,0,2558880,0,0,0]
[332,0,2558880,0,0,0]
[333,0,2558880,0,0,0]
[334,0,2558880,0,0,0]
[335,0,2558880,0,0,0]
[336,0,2558880,0,0,0]
[337,0,2558880,0,0,0]
[338,0,2558880,0,0,0]
[339,0,2558880,0,0,0]
[340,0,2558880,0,0,0]
[341,0,2558880,0,0,0]
[342,0,2558880,0,0,0]
[343,0,2558880,0,0,0]
[344,0,2558880,0,0,0]
[345,0,2558880,0,0,0]
[346,0,2558880,0,0,0]
[347,0,2558880,0,0,0]
[348,0,2558880,0,0,0]
[349,0,2558880,0,0,0]
[350,0,2558880,0,0,0]
[351,0,2558880,0,0,0]
[352,0,2558880,0,0,0]
[353,0,2558880,0,0,0]
[354,0,2558880,0,0,0]
[355,0,2558880,0,0,0]
[356,0,2558880,0,0,0]
[357,0,2558880,0,0,0]
[358,0,2558880,0,0,0]
[359,0,2558880,0,0,0]
[360,0,2558880,0,0,0]
[361,0,2558880,0,0,0]
[362,0,2558880,0,0,0]
[363,0,2558880,0,0,0]
[364,0,2558880,0,0,0]
[365,0,2558880,0,0,0]
[366,0,2558880,0,0,0]
[367,0,2558880,0,0,0]
[368,0,2558880,0,0,0]
[369,0,2558880,0,0,0]
[370,0,2558880,0,0,0]
[371,0,2558880,0,0,0]
[372,0,2558880,0,0,0]
[373,0,2558880,0,0,0]
[374,0,2558880,0,0,0]
[375,0,2558880,0,0,0]
[376,0,2558880,0,0,0]
[377,0,2558880,0,0,0]
[378,0,2558880,0,0,0]
[379,0,2558880,0,0,0]
[380,0,2558880,0,0,0]
[381,0,2558880,0,0,0]
[382,0,2558880,0,0,0]
[383,0,2558880,0,0,0]
[384,0,2558880,0,0,0]
[385,0,2558880,{"$f":"IF(A410<=$C$9,$C$13,0)","v":0},0,0]
[386,{"$f":"IF(A411<=$C$9,$C$15,0)","v":0},2558880,0,{"$f":"IF(A411<=$C$9,(D411+E410)*(1+$H$2),0)","v":0},{"$f":"IF(A411<=$C$9,(F410+D411)*(1+$I$2),0)","v":0}]
[387,0,{"$f":"B412+C411","v":2558880},0,0,0]
[388,0,2558880,0,0,0]
[389,0,2558880,0,0,0]
[390,0,2558880,0,0,0]
[391,0,2558880,0,0,0]
[392,0,2558880,0,0,0]
[393,0,2558880,0,0,0]
[394,0,2558880,0,0,0]
[395,0,2558880,0,0,0]
[396,0,2558880,0,0,0]
[397,0,2558880,0,0,0]
[398,0,2558880,0,0,0]
[399,0,2558880,0,0,0]
[400,0,2558880,0,0,0]
[401,0,2558880,0,0,0]
[402,0,2558880,0,0,0]
[403,0,2558880,0,0,0]
[404,0,2558880,0,0,0]
[405,0,2558880,0,0,0]
[406,0,2558880,0,0,0]
[407,0,2558880,0,0,0]
[408,0,2558880,0,0,0]
[409,0,2558880,0,0,0]
[410,0,2558880,0,0,0]
[411,0,2558880,0,0,0]
[412,0,2558880,0,0,0]
[413,0,2558880,0,0,0]
[414,0,2558880,0,0,0]
[415,0,2558880,0,0,0]
[416,0,2558880,0,0,0]
[417,0,2558880,0,0,0]
[418,0,2558880,0,0,0]
[419,0,2558880,0,0,0]
[420,0,2558880,0,0,0]
[421,0,2558880,0,0,0]
[422,0,2558880,0,0,0]
[423,0,2558880,0,0,0]
[424,0,2558880,0,0,0]
[425,0,2558880,0,0,0]
[426,0,2558880,0,0,0]
[427,0,2558880,0,0,0]
[428,0,2558880,0,0,0]
[429,0,2558880,0,0,0]
[430,0,2558880,0,0,0]
[431,0,2558880,0,0,0]
[432,0,2558880,0,0,0]
[433,0,2558880,0,0,0]
[434,0,2558880,0,0,0]
[435,0,2558880,0,0,0]
[436,0,2558880,0,0,0]
[437,0,2558880,0,0,0]
[438,0,2558880,0,0,0]
[439,0,2558880,0,0,0]
[440,0,2558880,0,0,0]
[441,0,2558880,0,0,0]
[442,0,2558880,0,0,0]
[443,0,2558880,0,0,0]
[444,0,2558880,0,0,0]
[445,0,2558880,0,0,0]
[446,0,2558880,0,0,0]
[447,0,2558880,0,0,0]
[448,0,2558880,0,0,0]
[449,0,2558880,{"$f":"IF(A474<=$C$9,$C$13,0)","v":0},0,0]
[450,{"$f":"IF(A475<=$C$9,$C$15,0)","v":0},2558880,0,{"$f":"IF(A475<=$C$9,(D475+E474)*(1+$H$2),0)","v":0},{"$f":"IF(A475<=$C$9,(F474+D475)*(1+$I$2),0)","v":0}]
[451,0,{"$f":"B476+C475","v":2558880},0,0,0]
[452,0,2558880,0,0,0]
[453,0,2558880,0,0,0]
[454,0,2558880,0,0,0]
[455,0,2558880,0,0,0]
[456,0,2558880,0,0,0]
[457,0,2558880,0,0,0]
[458,0,2558880,0,0,0]
[459,0,2558880,0,0,0]
[460,0,2558880,0,0,0]
[461,0,2558880,0,0,0]
[462,0,2558880,0,0,0]
[463,0,2558880,0,0,0]
[464,0,2558880,0,0,0]
[465,0,2558880,0,0,0]
[466,0,2558880,0,0,0]
[467,0,2558880,0,0,0]
[468,0,2558880,0,0,0]
[469,0,2558880,0,0,0]
[470,0,2558880,0,0,0]
[471,0,2558880,0,0,0]
[472,0,2558880,0,0,0]
[473,0,2558880,0,0,0]
[474,0,2558880,0,0,0]
[475,0,2558880,0,0,0]
[476,0,2558880,0,0,0]
[477,0,2558880,0,0,0]
[478,0,2558880,0,0,0]
[479,0,2558880,0,0,0]
[480,0,2558880,0,0,0]
[481,0,2558880,0,0,0]
[482,0,2558880,0,0,0]
[483,0,2558880,0,0,0]
[484,0,2558880,0,0,0]
[485,0,2558880,0,0,0]
[486,0,2558880,0,0,0]
[487,0,2558880,0,0,0]
[488,0,2558880,0,0,0]
[489,0,2558880,0,0,0]
[490,0,2558880,0,0,0]
[491,0,2558880,0,0,0]
[492,0,2558880,0,0,0]
[493,0,2558880,0,0,0]
[494,0,2558880,0,0,0]
[495,0,2558880,0,0,0]
[496,0,2558880,0,0,0]
[497,0,2558880,0,0,0]
[498,0,2558880,0,0,0]
[499,0,2558880,0,0,0]
[500,0,2558880,0,0,0]
[501,0,2558880,0,0,0]
[502,0,2558880,0,0,0]
[503,0,2558880,0,0,0]
[504,0,2558880,0,0,0]
[505,0,2558880,0,0,0]
[506,0,2558880,0,0,0]
[507,0,2558880,0,0,0]
[508,0,2558880,0,0,0]
[509,0,2558880,0,0,0]
[510,0,2558880,0,0,0]
[511,0,2558880,0,0,0]
[512,0,2558880,0,0,0]
[513,0,2558880,{"$f":"IF(A538<=$C$9,$C$13,0)","v":0},0,0]
[514,{"$f":"IF(A539<=$C$9,$C$15,0)","v":0},2558880,0,{"$f":"IF(A539<=$C$9,(D539+E538)*(1+$H$2),0)","v":0},{"$f":"IF(A539<=$C$9,(F538+D539)*(1+$I$2),0)","v":0}]
[515,0,{"$f":"B540+C539","v":2558880},0,0,0]
[516,0,2558880,0,0,0]
[517,0,2558880,0,0,0]
[518,0,2558880,0,0,0]
[519,0,2558880,0,0,0]
[520,0,2558880,0,0,0]
[521,0,2558880,0,0,0]
[522,0,2558880,0,0,0]
[523,0,2558880,0,0,0]
[524,0,2558880,0,0,0]
[525,0,2558880,0,0,0]
[526,0,2558880,0,0,0]
[527,0,2558880,0,0,0]
[528,0,2558880,0,0,0]
[529,0,2558880,0,0,0]
[530,0,2558880,0,0,0]
[531,0,2558880,0,0,0]
[532,0,2558880,0,0,0]
[533,0,2558880,0,0,0]
[534,0,2558880,0,0,0]
[535,0,2558880,0,0,0]
[536,0,2558880,0,0,0]
[537,0,2558880,0,0,0]
[538,0,2558880,0,0,0]
[539,0,2558880,0,0,0]
[540,0,2558880,0,0,0]
[541,0,2558880,0,0,0]
[542,0,2558880,0,0,0]
[543,0,2558880,0,0,0]
[544,0,2558880,0,0,0]
[545,0,2558880,0,0,0]
[546,0,2558880,0,0,0]
[547,0,2558880,0,0,0]
[548,0,2558880,0,0,0]
[549,0,2558880,0,0,0]
[550,0,2558880,0,0,0]
[551,0,2558880,0,0,0]
[552,0,2558880,0,0,0]
[553,0,2558880,0,0,0]
[554,0,2558880,0,0,0]
[555,0,2558880,0,0,0]
[556,0,2558880,0,0,0]
[557,0,2558880,0,0,0]
[558,0,2558880,0,0,0]
[559,0,2558880,0,0,0]
[560,0,2558880,0,0,0]
[561,0,2558880,0,0,0]
[562,0,2558880,0,0,0]
[563,0,2558880,0,0,0]
[564,0,2558880,0,0,0]
[565,0,2558880,0,0,0]
[566,0,2558880,0,0,0]
[567,0,2558880,0,0,0]
[568,0,2558880,0,0,0]
[569,0,2558880,0,0,0]
[570,0,2558880,0,0,0]
[571,0,2558880,0,0,0]
[572,0,2558880,0,0,0]
[573,0,2558880,0,0,0]
[574,0,2558880,0,0,0]
[575,0,2558880,0,0,0]
[576,0,2558880,0,0,0]
[577,0,2558880,{"$f":"IF(A602<=$C$9,$C$13,0)","v":0},0,0]
[578,{"$f":"IF(A603<=$C$9,$C$15,0)","v":0},2558880,0,{"$f":"IF(A603<=$C$9,(D603+E602)*(1+$H$2),0)","v":0},{"$f":"IF(A603<=$C$9,(F602+D603)*(1+$I$2),0)","v":0}]
[579,0,{"$f":"B604+C603","v":2558880},0,0,0]
[580,0,2558880,0,0,0]
[581,0,2558880,0,0,0]
[582,0,2558880,0,0,0]
[583,0,2558880,0,0,0]
[584,0,2558880,0,0,0]
[585,0,2558880,0,0,0]
[586,0,2558880,0,0,0]
[587,0,2558880,0,0,0]
[588,0,2558880,0,0,0]
[589,0,2558880,0,0,0]
[590,0,2558880,0,0,0]
[591,0,2558880,0,0,0]
[592,0,2558880,0,0,0]
[593,0,2558880,0,0,0]
[594,0,2558880,0,0,0]
[595,0,2558880,0,0,0]
[596,0,2558880,0,0,0]
[597,0,2558880,0,0,0]
[598,0,2558880,0,0,0]
[599,0,2558880,0,0,0]
[600,0,2558880,0,0,0]
[601,0,2558880,0,0,0]
[602,0,2558880,0,0,0]
[603,0,2558880,0,0,0]
[604,0,2558880,0,0,0]
[605,0,2558880,0,0,0]
[606,0,2558880,0,0,0]
[607,0,2558880,0,0,0]
[608,0,2558880,0,0,0]
[609,0,2558880,0,0,0]
[610,0,2558880,0,0,0]
[611,0,2558880,0,0,0]
[612,0,2558880,0,0,0]
[613,0,2558880,0,0,0]
[614,0,2558880,0,0,0]
[615,0,2558880,0,0,0]
[616,0,2558880,0,0,0]
[617,0,2558880,0,0,0]
[618,0,2558880,0,0,0]
[619,0,2558880,0,0,0]
[620,0,2558880,0,0,0]
[621,0,2558880,0,0,0]
[622,0,2558880,0,0,0]
[623,0,2558880,0,0,0]
[624,0,2558880,0,0,0]
[625,0,2558880,0,0,0]
[626,0,2558880,0,0,0]
[627,0,2558880,0,0,0]
[628,0,2558880,0,0,0]
[629,0,2558880,0,0,0]
[630,0,2558880,0,0,0]
[631,0,2558880,0,0,0]
[632,0,2558880,0,0,0]
[633,0,2558880,0,0,0]
[634,0,2558880,0,0,0]
[635,0,2558880,0,0,0]
[636,0,2558880,0,0,0]
[637,0,2558880,0,0,0]
[638,0,2558880,0,0,0]
[639,0,2558880,0,0,0]
[640,0,2558880,0,0,0]
[641,0,2558880,{"$f":"IF(A666<=$C$9,$C$13,0)","v":0},0,0]
[642,{"$f":"IF(A667<=$C$9,$C$15,0)","v":0},2558880,0,{"$f":"IF(A667<=$C$9,(D667+E666)*(1+$H$2),0)","v":0},{"$f":"IF(A667<=$C$9,(F666+D667)*(1+$I$2),0)","v":0}]
[643,0,{"$f":"B668+C667","v":2558880},0,0,0]
[644,0,2558880,0,0,0]
[645,0,2558880,0,0,0]
[646,0,2558880,0,0,0]
[647,0,2558880,0,0,0]
[648,0,2558880,0,0,0]
[649,0,2558880,0,0,0]
[650,0,2558880,0,0,0]
[651,0,2558880,0,0,0]
[652,0,2558880,0,0,0]
[653,0,2558880,0,0,0]
[654,0,2558880,0,0,0]
[655,0,2558880,0,0,0]
[656,0,2558880,0,0,0]
[657,0,2558880,0,0,0]
[658,0,2558880,0,0,0]
[659,0,2558880,0,0,0]
[660,0,2558880,0,0,0]
[661,0,2558880,0,0,0]
[662,0,2558880,0,0,0]
[663,0,2558880,0,0,0]
[664,0,2558880,0,0,0]
[665,0,2558880,0,0,0]
[666,0,2558880,0,0,0]
[667,0,2558880,0,0,0]
[668,0,2558880,0,0,0]
[669,0,2558880,0,0,0]
[670,0,2558880,0,0,0]
[671,0,2558880,0,0,0]
[672,0,2558880,0,0,0]
[673,0,2558880,0,0,0]
[674,0,2558880,0,0,0]
[675,0,2558880,0,0,0]
[676,0,2558880,0,0,0]
[677,0,2558880,0,0,0]
[678,0,2558880,0,0,0]
[679,0,2558880,0,0,0]
[680,0,2558880,0,0,0]
[681,0,2558880,0,0,0]
[682,0,2558880,0,0,0]
[683,0,2558880,0,0,0]
[684,0,2558880,0,0,0]
[685,0,2558880,0,0,0]
[686,0,2558880,0,0,0]
[687,0,2558880,0,0,0]
[688,0,2558880,0,0,0]
[689,0,2558880,0,0,0]
[690,0,2558880,0,0,0]
[691,0,2558880,0,0,0]
[692,0,2558880,0,0,0]
[693,0,2558880,0,0,0]
[694,0,2558880,0,0,0]
[695,0,2558880,0,0,0]
[696,0,2558880,0,0,0]
[697,0,2558880,0,0,0]
[698,0,2558880,0,0,0]
[699,0,2558880,0,0,0]
[700,0,2558880,0,0,0]
[701,0,2558880,0,0,0]
[702,0,2558880,0,0,0]
[703,0,2558880,0,0,0]
[704,0,2558880,0,0,0]
[705,0,2558880,{"$f":"IF(A730<=$C$9,$C$13,0)","v":0},0,0]
[706,{"$f":"IF(A731<=$C$9,$C$15,0)","v":0},2558880,0,{"$f":"IF(A731<=$C$9,(D731+E730)*(1+$H$2),0)","v":0},{"$f":"IF(A731<=$C$9,(F730+D731)*(1+$I$2),0)","v":0}]
[707,0,{"$f":"B732+C731","v":2558880},0,0,0]
[708,0,2558880,0,0,0]
[709,0,2558880,0,0,0]
[710,0,2558880,0,0,0]
[711,0,2558880,0,0,0]
[712,0,2558880,0,0,0]
[713,0,2558880,0,0,0]
[714,0,2558880,0,0,0]
[715,0,2558880,0,0,0]
[716,0,2558880,0,0,0]
[717,0,2558880,0,0,0]
[718,0,2558880,0,0,0]
[719,0,2558880,0,0,0]
[720,0,2558880,0,0,0]
[721,0,2558880,0,0,0]
[722,0,2558880,0,0,0]
[723,0,2558880,0,0,0]
[724,0,2558880,0,0,0]
[725,0,2558880,0,0,0]
[726,0,2558880,0,0,0]
[727,0,2558880,0,0,0]
[728,0,2558880,0,0,0]
[729,0,2558880,0,0,0]
[730,0,2558880,0,0,0]
[731,0,2558880,0,0,0]
[732,0,2558880,0,0,0]
[733,0,2558880,0,0,0]
[734,0,2558880,0,0,0]
[735,0,2558880,0,0,0]
[736,0,2558880,0,0,0]
[737,0,2558880,0,0,0]
[738,0,2558880,0,0,0]
[739,0,2558880,0,0,0]
[740,0,2558880,0,0,0]
[741,0,2558880,0,0,0]
[742,0,2558880,0,0,0]
[743,0,2558880,0,0,0]
[744,0,2558880,0,0,0]
[745,0,2558880,0,0,0]
[746,0,2558880,0,0,0]
[747,0,2558880,0,0,0]
[748,0,2558880,0,0,0]
[749,0,2558880,0,0,0]
[750,0,2558880,0,0,0]
[751,0,2558880,0,0,0]
[752,0,2558880,0,0,0]
[753,0,2558880,0,0,0]
[754,0,2558880,0,0,0]
[755,0,2558880,0,0,0]
[756,0,2558880,0,0,0]
[757,0,2558880,0,0,0]
[758,0,2558880,0,0,0]
[759,0,2558880,0,0,0]
[760,0,2558880,0,0,0]
[761,0,2558880,0,0,0]
[762,0,2558880,0,0,0]
[763,0,2558880,0,0,0]
[764,0,2558880,0,0,0]
[765,0,2558880,0,0,0]
[766,0,2558880,0,0,0]
[767,0,2558880,0,0,0]
[768,0,2558880,0,0,0]
[769,0,2558880,{"$f":"IF(A794<=$C$9,$C$13,0)","v":0},0,0]
[770,{"$f":"IF(A795<=$C$9,$C$15,0)","v":0},2558880,0,{"$f":"IF(A795<=$C$9,(D795+E794)*(1+$H$2),0)","v":0},{"$f":"IF(A795<=$C$9,(F794+D795)*(1+$I$2),0)","v":0}]
[771,0,{"$f":"B796+C795","v":2558880},0,0,0]
[772,0,2558880,0,0,0]
[773,0,2558880,0,0,0]
[774,0,2558880,0,0,0]
[775,0,2558880,0,0,0]
[776,0,2558880,0,0,0]
[777,0,2558880,0,0,0]
[778,0,2558880,0,0,0]
[779,0,2558880,0,0,0]
[780,0,2558880,0,0,0]
[781,0,2558880,0,0,0]
[782,0,2558880,0,0,0]
[783,0,2558880,0,0,0]
[784,0,2558880,0,0,0]
[785,0,2558880,0,0,0]
[786,0,2558880,0,0,0]
[787,0,2558880,0,0,0]
[788,0,2558880,0,0,0]
[789,0,2558880,0,0,0]
[790,0,2558880,0,0,0]
[791,0,2558880,0,0,0]
[792,0,2558880,0,0,0]
[793,0,2558880,0,0,0]
[794,0,2558880,0,0,0]
[795,0,2558880,0,0,0]
[796,0,2558880,0,0,0]
[797,0,2558880,0,0,0]
[798,0,2558880,0,0,0]
[799,0,2558880,0,0,0]
[800,0,2558880,0,0,0]
[801,0,2558880,0,0,0]
[802,0,2558880,0,0,0]
[803,0,2558880,0,0,0]
[804,0,2558880,0,0,0]
[805,0,2558880,0,0,0]
[806,0,2558880,0,0,0]
[807,0,2558880,0,0,0]
[808,0,2558880,0,0,0]
[809,0,2558880,0,0,0]
[810,0,2558880,0,0,0]
[811,0,2558880,0,0,0]
[812,0,2558880,0,0,0]
[813,0,2558880,0,0,0]
[814,0,2558880,0,0,0]
[815,0,2558880,0,0,0]
[816,0,2558880,0,0,0]
[817,0,2558880,0,0,0]
[818,0,2558880,0,0,0]
[819,0,2558880,0,0,0]
[820,0,2558880,0,0,0]
[821,0,2558880,0,0,0]
[822,0,2558880,0,0,0]
[823,0,2558880,0,0,0]
[824,0,2558880,0,0,0]
[825,0,2558880,0,0,0]
[826,0,2558880,0,0,0]
[827,0,2558880,0,0,0]
[828,0,2558880,0,0,0]
[829,0,2558880,0,0,0]
[830,0,2558880,0,0,0]
[831,0,2558880,0,0,0]
[832,0,2558880,0,0,0]
[833,0,2558880,{"$f":"IF(A858<=$C$9,$C$13,0)","v":0},0,0]
[834,{"$f":"IF(A859<=$C$9,$C$15,0)","v":0},2558880,0,{"$f":"IF(A859<=$C$9,(D859+E858)*(1+$H$2),0)","v":0},{"$f":"IF(A859<=$C$9,(F858+D859)*(1+$I$2),0)","v":0}]
[835,0,{"$f":"B860+C859","v":2558880},0,0,0]
[836,0,2558880,0,0,0]
[837,0,2558880,0,0,0]
[838,0,2558880,0,0,0]
[839,0,2558880,0,0,0]
[840,0,2558880,0,0,0]
[841,0,2558880,0,0,0]
[842,0,2558880,0,0,0]
[843,0,2558880,0,0,0]
[844,0,2558880,0,0,0]
[845,0,2558880,0,0,0]
[846,0,2558880,0,0,0]
[847,0,2558880,0,0,0]
[848,0,2558880,0,0,0]
[849,0,2558880,0,0,0]
[850,0,2558880,0,0,0]
[851,0,2558880,0,0,0]
[852,0,2558880,0,0,0]
[853,0,2558880,0,0,0]
[854,0,2558880,0,0,0]
[855,0,2558880,0,0,0]
[856,0,2558880,0,0,0]
[857,0,2558880,0,0,0]
[858,0,2558880,0,0,0]
[859,0,2558880,0,0,0]
[860,0,2558880,0,0,0]
[861,0,2558880,0,0,0]
[862,0,2558880,0,0,0]
[863,0,2558880,0,0,0]
[864,0,2558880,0,0,0]
[865,0,2558880,0,0,0]
[866,0,2558880,0,0,0]
[867,0,2558880,0,0,0]
[868,0,2558880,0,0,0]
[869,0,2558880,0,0,0]
[870,0,2558880,0,0,0]
[871,0,2558880,0,0,0]
[872,0,2558880,0,0,0]
[873,0,2558880,0,0,0]
[874,0,2558880,0,0,0]
[875,0,2558880,0,0,0]
[876,0,2558880,0,0,0]
[877,0,2558880,0,0,0]
[878,0,2558880,0,0,0]
[879,0,2558880,0,0,0]
[880,0,2558880,0,0,0]
[881,0,2558880,0,0,0]
[882,0,2558880,0,0,0]
[883,0,2558880,0,0,0]
[884,0,2558880,0,0,0]
[885,0,2558880,0,0,0]
[886,0,2558880,0,0,0]
[887,0,2558880,0,0,0]
[888,0,2558880,0,0,0]
[889,0,2558880,0,0,0]
[890,0,2558880,0,0,0]
[891,0,2558880,0,0,0]
[892,0,2558880,0,0,0]
[893,0,2558880,0,0,0]
[894,0,2558880,0,0,0]
[895,0,2558880,0,0,0]
[896,0,2558880,0,0,0]
[897,0,2558880,{"$f":"IF(A922<=$C$9,$C$13,0)","v":0},0,0]
[898,{"$f":"IF(A923<=$C$9,$C$15,0)","v":0},2558880,0,{"$f":"IF(A923<=$C$9,(D923+E922)*(1+$H$2),0)","v":0},{"$f":"IF(A923<=$C$9,(F922+D923)*(1+$I$2),0)","v":0}]
[899,0,{"$f":"B924+C923","v":2558880},0,0,0]
[900,0,2558880,0,0,0]
[901,0,2558880,0,0,0]
[902,0,2558880,0,0,0]
[903,0,2558880,0,0,0]
[904,0,2558880,0,0,0]
[905,0,2558880,0,0,0]
[906,0,2558880,0,0,0]
[907,0,2558880,0,0,0]
[908,0,2558880,0,0,0]
[909,0,2558880,0,0,0]
[910,0,2558880,0,0,0]
[911,0,2558880,0,0,0]
[912,0,2558880,0,0,0]
[913,0,2558880,0,0,0]
[914,0,2558880,0,0,0]
[915,0,2558880,0,0,0]
[916,0,2558880,0,0,0]
[917,0,2558880,0,0,0]
[918,0,2558880,0,0,0]
[919,0,2558880,0,0,0]
[920,0,2558880,0,0,0]
[921,0,2558880,0,0,0]
[922,0,2558880,0,0,0]
[923,0,2558880,0,0,0]
[924,0,2558880,0,0,0]
[925,0,2558880,0,0,0]
[926,0,2558880,0,0,0]
[927,0,2558880,0,0,0]
[928,0,2558880,0,0,0]
[929,0,2558880,0,0,0]
[930,0,2558880,0,0,0]
[931,0,2558880,0,0,0]
[932,0,2558880,0,0,0]
[933,0,2558880,0,0,0]
[934,0,2558880,0,0,0]
[935,0,2558880,0,0,0]
[936,0,2558880,0,0,0]
[937,0,2558880,0,0,0]
[938,0,2558880,0,0,0]
[939,0,2558880,0,0,0]
[940,0,2558880,0,0,0]
[941,0,2558880,0,0,0]
[942,0,2558880,0,0,0]
[943,0,2558880,0,0,0]
[944,0,2558880,0,0,0]
[945,0,2558880,0,0,0]
[946,0,2558880,0,0,0]
[947,0,2558880,0,0,0]
[948,0,2558880,0,0,0]
[949,0,2558880,0,0,0]
[950,0,2558880,0,0,0]
[951,0,2558880,0,0,0]
[952,0,2558880,0,0,0]
[953,0,2558880,0,0,0]
[954,0,2558880,0,0,0]
[955,0,2558880,0,0,0]
[956,0,2558880,0,0,0]
[957,0,2558880,0,0,0]
[958,0,2558880,0,0,0]
[959,0,2558880,0,0,0]
[960,0,2558880,0,0,0]
[961,0,2558880,{"$f":"IF(A986<=$C$9,$C$13,0)","v":0},0,0]
[962,{"$f":"IF(A987<=$C$9,$C$15,0)","v":0},2558880,0,{"$f":"IF(A987<=$C$9,(D987+E986)*(1+$H$2),0)","v":0},{"$f":"IF(A987<=$C$9,(F986+D987)*(1+$I$2),0)","v":0}]
[963,0,{"$f":"B988+C987","v":2558880},0,0,0]
[964,0,2558880,0,0,0]
[965,0,2558880,0,0,0]
[966,0,2558880,0,0,0]
[967,0,2558880,0,0,0]
[968,0,2558880,0,0,0]
[969,0,2558880,0,0,0]
[970,0,2558880,0,0,0]
[971,0,2558880,0,0,0]
[972,0,2558880,0,0,0]
[973,0,2558880,0,0,0]
[974,0,2558880,0,0,0]
[975,0,2558880,0,0,0]
[976,0,2558880,0,0,0]
[977,0,2558880,0,0,0]
[978,0,2558880,0,0,0]
[979,0,2558880,0,0,0]
[980,0,2558880,0,0,0]
[981,0,2558880,0,0,0]
[982,0,2558880,0,0,0]
[983,0,2558880,0,0,0]
[984,0,2558880,0,0,0]
[985,0,2558880,0,0,0]
[986,0,2558880,0,0,0]
[987,0,2558880,0,0,0]
[988,0,2558880,0,0,0]
[989,0,2558880,0,0,0]
[990,0,2558880,0,0,0]
[991,0,2558880,0,0,0]
[992,0,2558880,0,0,0]
[993,0,2558880,0,0,0]
[994,0,2558880,0,0,0]
[995,0,2558880,0,0,0]
[996,0,2558880,0,0,0]
[997,0,2558880,0,0,0]
[998,0,2558880,0,0,0]
[999,0,2558880,0,0,0]
[1000,0,2558880,0,0,0]
[1001,0,2558880,0,0,0]
[1002,0,2558880,0,0,0]
[1003,0,2558880,0,0,0]
[1004,0,2558880,0,0,0]
[1005,0,2558880,0,0,0]
[1006,0,2558880,0,0,0]
[1007,0,2558880,0,0,0]
[1008,0,2558880,0,0,0]
[1009,0,2558880,0,0,0]
[1010,0,2558880,0,0,0]

{"sheet":"CALCUL","index":7,"n_rows":1122,"n_cols":31,"rows_kept":1122,"cut":false,"hidden":true,"merged":[[73,10,73,12],[12,0,12,1],[19,0,19,1],[48,0,48,2],[49,0,49,2],[51,0,51,2],[73,0,73,2],[10,0,10,1],[4,0,4,1],[5,0,5,1],[6,0,6,1],[7,0,7,1],[9,0,9,1]]}
[]
[]
[]
[]
["RENTE A SERVIR",null,{"$f":"'Module '!#REF!","v":{"$error":"#REF!"}}]
[]
["DUREE DE SERVICE ",null,{"$f":"'Module '!#REF!","v":{"$error":"#REF!"}}]
[]
[]
[]
["DATE EFFET",null,{"$f":"'Module '!#REF!","v":{"$error":"#REF!"}}]
[]
["DATE RETRAITE",null,{"$f":"DATE(YEAR(C11)+C17,MONTH(C11),DAY(C11)-1)","v":{"$error":"#REF!"}}]
[]
["DUREE EN MOIS",null,{"$f":"C17*12","v":{"$error":"#REF!"}}]
[]
["DUREE EN ANNEE",null,{"$f":"'Module '!#REF!","v":{"$error":"#REF!"}}]
[]
[]
["DATE NAISSANCE",null,{"$f":"+'Module '!#REF!","v":{"$error":"#REF!"}}]
[]
[]
[]
[]
[]
[]
[]
["Police","xxxxxxxxxx",null,"ID","xxxxxx",null,null,"Date effet",{"$f":"+C11","v":{"$error":"#REF!"}},null,null,null,"DURRE CO ",15,"Nbre année de cotis pr cap dec",{"$f":"12*MIN(N28,10)","v":120}]
[null,null,null,null,null,null,null,null,null,null,null,null,"Vieillissement",0]
[]
[null,null,null,null,null,null,null,null,null,null,null,null,null,null,null,{"$f":"2016-25","v":1991},null,null,null,null,null,null,null,null,{"$f":"C35/12","v":2.9166666666666668E-3},{"$f":"C36/12","v":1.6229166666666673E-3}]
[]
[]
[null,"Taux d'interet",null,null,null,null,"Frais d'acquisition",null,null,null,"Frais de Gestion",null,null,null,"Autres",null,null,null,null,null,null,null,null,null,{"$f":"1+Y31","v":1.0029166666666667},{"$f":"1+Z31","v":1.0016229166666666},null,{"$f":"1-L36-H35","v":0.95}]
[null,"taux interet technique",3.5000000000000003E-2,null,null,null,"taux de frais d'acquisition",0.05,null,null,"taux frais fract. mens",{"$f":"'[3]Comparatif ii - v'!C6","v":0},null,null,"date de naissance","1991-12-16",null,null,null,null,null,null,null,null,{"$f":"Y34^12","v":1.0355669529459706},{"$f":"Z34^12","v":1.019649778501541}]
[null,"taux interet reel",{"$f":"C35-L37*(1+C35)","v":1.9475000000000006E-2},null,null,null,"duree maximale pr calcul",20,null,null,"taux frais gestion prime",{"$f":"'[3]Comparatif ii - v'!B6","v":0},null,null,"taux majoration qx",0]
[null,"taux interet oper deces",3.5000000000000003E-2,null,null,null,"Escompte?","N",null,null,"taux frais gestion PM",1.4999999999999999E-2,null,null,"date de calcul PM",{"$f":"DATE(YEAR(I28)+N28,MONTH(I28),DAY(I28)-1)","v":{"$error":"#REF!"}}]
[null,null,{"$f":"C35/12","v":2.9166666666666668E-3},null,null,null,null,null,null,null,"taux frais gestion deces",0.2,null,null,"Capital deces",{"$f":"D52","v":{"$error":"#REF!"}}]
[null,null,null,null,"taux frais d'acquisition décès",null,null,0.15,null,null,"Assiette gestion contrat","PHT",null,null,"Doublement deces accidentel",0]
[null,null,null,null,null,null,null,null,null,null,"Gestion de rente",{"$f":"'[3]Comparatif ii - v'!F6","v":0},null,"taxes sur décès",null,0.03]
[]
[null,"mensuel composé",{"$f":"(1+C36)^(1/12)-1","v":1.6086081665731555E-3}]
[]
["taux equivalent mensuel de 3.5%",null,2.8708987190766422E-3]
[null,null,null,null,null,null,null,null,null,null,null,null,null,null,null,null,91]
[]
[]
[]
["Capital Constitutif de la rente certaine",null,null,{"$f":"C5*(1+L40)*(1+C44)*(1-(1+C44)^(-C7))/C44","v":{"$error":"#REF!"}},null,"Cotisation",{"$f":"+C86+H86","v":{"$error":"#REF!"}}]
["Valeur actuelle du capital  Constitutif ",null,null,{"$f":"D49*(1+C42)^(-C15)","v":{"$error":"#REF!"}},null,"Capital au Terme",{"$f":"VLOOKUP(C15,$A$97:$N$2001,11,FALSE)","v":{"$error":"#REF!"}}]
[null,null,null,null,null,null,null,null,null,null,{"$f":"10010*12*7","v":840840}]
["Capital décès",null,null,{"$f":"+C5*12/2","v":{"$error":"#REF!"}}]
[null,null,null,null,null,null,null,{"$f":"H76*C15","v":{"$error":"#REF!"}}]
[]
[]
[]
[]
[]
[]
[]
[]
[]
[null,null,null,null,null,45,7.2725514615978358E-3]
[null,null,null,null,null,46,7.7255073396599282E-3]
[null,null,null,null,null,47,8.1617875035729145E-3]
[null,null,null,null,null,48,8.5865291767752722E-3]
[null,null,null,null,null,49,9.0100957937642081E-3]
[null,null,null,null,null,50,9.4341168655183334E-3]
[]
[]
[]
[]
[]
["Prime mesuelle garantie décès",null,null,null,null,"Prime mesuelle garantie décès",null,null,null,null,"Cumul"]
[]
["Prime pure décès ",null,{"$f":"IF('Module '!#REF!=1,G63*D52/12,0)","v":{"$error":"#REF!"}},null,null,"Prime pure capi",null,{"$f":"D50/((1+C42)*(1-(1+C42)^(-C15))/C42)","v":{"$error":"#REF!"}},null,null,"Prime pure capi",null,{"$f":"C76+H76","v":{"$error":"#REF!"}}]
[]
["Frais de gestion déces",null,0,null,null,"Frais de gestion ",null,{"$f":"H76/(1-L35-L36-H35)*L36","v":{"$error":"#REF!"}},null,null,"Frais de gestion ",null,{"$f":"C78+H78","v":{"$error":"#REF!"}}]
[]
["Frais de fractionnement",null,{"$f":"C76/(1-H39-L38-L35)*L35","v":{"$error":"#REF!"}},null,null,"Frais de fractionnement",null,{"$f":"H76/(1-L35-L36-H35)*L35","v":{"$error":"#REF!"}},null,null,"Frais de gestion Encours",null,{"$f":"VLOOKUP(C15,$A$97:$N$2001,14,FALSE)","v":{"$error":"#REF!"}}]
[]
["Frais d'acquisition sur le dé",null,0,null,null,"Frais d'acquisition",null,{"$f":"H76/(1-L35-L36-H35)*H35","v":{"$error":"#REF!"}},null,null,"Frais de fractionnement",null,{"$f":"C80+H80","v":{"$error":"#REF!"}}]
[]
["Taxes sur décès",null,{"$f":"(C76+C78+C82+L35+C80)*P40","v":{"$error":"#REF!"}},null,null,"Taxes ",null,{"$f":"(H76+H78+H82+Q36)*U41","v":{"$error":"#REF!"}},null,null,"Frais d'acquisition",null,{"$f":"C82+H82","v":{"$error":"#REF!"}}]
[]
["Prime menselle TTC",null,{"$f":"C76+C78+C82+C84","v":{"$error":"#REF!"}},null,null,"Prime menselle TTC",null,{"$f":"H76+H78+H82+H84+H80","v":{"$error":"#REF!"}},null,null,"Taxes ",null,{"$f":"C84+H84","v":{"$error":"#REF!"}}]
[]
[null,null,null,null,null,null,null,null,null,null,"Prime menselle TTC",null,{"$f":"C86+H86","v":{"$error":"#REF!"}}]
[]
[]
[]
[]
[]
[]
[null,null,null,null,null,null,null,null,null,null,null,null,null,null,null,null,null,null,null,null,null,null,null,null,{"$f":"Y35-1","v":3.5566952945970565E-2},{"$f":"Z35-1","v":1.9649778501541038E-2},null,{"$f":"(Y34^60)-1","v":0.19094282914289407},{"$f":"AB95/Y31","v":65.466112848992253},{"$f":"0.95*Y34*6000","v":5716.625}]
["N°","Date réception","Date échéance","Cotis","Cions","Fract.","Gestion","Prime dec com mens","Cot epargne","PM DEBUT","PM Fin","PM DEBUT","PM Fin","frais de gestion sur encours",null,null,null,null,null,null,null,null,null,null,{"$f":"Y95/Y31","v":12.194383867189908},{"$f":"Z95/Z31","v":12.107694070269185},null,null,null,{"$f":"AD95*AC95","v":374245.21736537036}]
[1,{"$f":"I28","v":{"$error":"#REF!"}},{"$f":"B97","v":{"$error":"#REF!"}},{"$f":"$G$49","v":{"$error":"#REF!"}},{"$f":"+$C$82+$H$82","v":{"$error":"#REF!"}},{"$f":"+$C$80+$H$80","v":{"$error":"#REF!"}},{"$f":"+$C$78+$H$78","v":{"$error":"#REF!"}},{"$f":"+$C$76+$C$84","v":{"$error":"#REF!"}},{"$f":"D97-E97-F97-G97-H97","v":{"$error":"#REF!"}},{"$f":"+I97","v":{"$error":"#REF!"}},{"$f":"+(1+$C$42)*J97","v":{"$error":"#REF!"}},{"$f":"I97","v":{"$error":"#REF!"}},{"$f":"L97*(1+$C$44)","v":{"$error":"#REF!"}},{"$f":"M97-K97","v":{"$error":"#REF!"}},null,null,null,null,null,null,null,null,null,null,{"$f":"Y96*Y34","v":12.229950820135878},{"$f":"Z96*Z34","v":12.127343848770725},null,{"$f":"S97/H97","v":{"$error":"#REF!"}},null,null,1]
[2,{"$f":"DATE(YEAR(B97),MONTH(B97)+1,DAY(B97))","v":{"$error":"#REF!"}},{"$f":"B98","v":{"$error":"#REF!"}},{"$error":"#REF!"},{"$f":"+$C$82+$H$82","v":{"$error":"#REF!"}},{"$f":"+$C$80+$H$80","v":{"$error":"#REF!"}},{"$f":"+$C$78+$H$78","v":{"$error":"#REF!"}},{"$f":"+$C$76+$C$84","v":{"$error":"#REF!"}},{"$f":"D98-E98-F98-G98-H98","v":{"$error":"#REF!"}},{"$f":"+K97+I98","v":{"$error":"#REF!"}},{"$f":"+(1+$C$42)*J98","v":{"$error":"#REF!"}},{"$f":"M97+I98","v":{"$error":"#REF!"}},{"$f":"L98*(1+$C$44)","v":{"$error":"#REF!"}},{"$f":"M98-K98","v":{"$error":"#REF!"}},null,null,null,null,null,null,null,null,null,null,{"$f":"$H$97*Y97","v":{"$error":"#REF!"}},{"$f":"$H$97*Z97","v":{"$error":"#REF!"}},88815,null,null,null,2]
[3,{"$f":"DATE(YEAR(B98),MONTH(B98)+1,DAY(B98))","v":{"$error":"#REF!"}},{"$error":"#REF!"},{"$error":"#REF!"},{"$f":"+$C$82+$H$82","v":{"$error":"#REF!"}},{"$error":"#REF!"},{"$error":"#REF!"},{"$error":"#REF!"},{"$error":"#REF!"},{"$f":"+K98+I99","v":{"$error":"#REF!"}},{"$f":"+(1+$C$42)*J99","v":{"$error":"#REF!"}},{"$f":"M98+I99","v":{"$error":"#REF!"}},{"$f":"L99*(1+$C$44)","v":{"$error":"#REF!"}},{"$error":"#REF!"},null,null,null,null,null,null,null,null,null,null,null,null,null,null,null,null,3]
[4,{"$error":"#REF!"},{"$error":"#REF!"},{"$error":"#REF!"},{"$error":"#REF!"},{"$error":"#REF!"},{"$error":"#REF!"},{"$error":"#REF!"},{"$error":"#REF!"},{"$f":"+K99+I100","v":{"$error":"#REF!"}},{"$f":"+(1+$C$42)*J100","v":{"$error":"#REF!"}},{"$error":"#REF!"},{"$error":"#REF!"},{"$error":"#REF!"},null,null,null,null,null,null,null,null,null,null,null,null,null,null,null,null,4]
[5,{"$error":"#REF!"},{"$error":"#REF!"},{"$error":"#REF!"},{"$error":"#REF!"},{"$error":"#REF!"},{"$error":"#REF!"},{"$error":"#REF!"},{"$error":"#REF!"},{"$error":"#REF!"},{"$f":"+(1+$C$42)*J101","v":{"$error":"#REF!"}},{"$error":"#REF!"},{"$error":"#REF!"},{"$error":"#REF!"},null,null,null,null,null,null,null,null,null,null,null,null,null,null,null,null,5]
[6,{"$error":"#REF!"},{"$error":"#REF!"},{"$error":"#REF!"},{"$error":"#REF!"},{"$error":"#REF!"},{"$error":"#REF!"},{"$error":"#REF!"},{"$error":"#REF!"},{"$error":"#REF!"},{"$error":"#REF!"},{"$error":"#REF!"},{"$error":"#REF!"},{"$error":"#REF!"},null,null,null,null,null,null,null,null,null,null,null,null,null,null,null,null,6]
[7,{"$error":"#REF!"},{"$error":"#REF!"},{"$error":"#REF!"},{"$error":"#REF!"},{"$error":"#REF!"},{"$error":"#REF!"},{"$error":"#REF!"},{"$error":"#REF!"},{"$error":"#REF!"},{"$error":"#REF!"},{"$error":"#REF!"},{"$error":"#REF!"},{"$error":"#REF!"},null,null,null,null,null,null,null,null,null,null,null,null,null,null,null,null,7]
[8,{"$error":"#REF!"},{"$error":"#REF!"},{"$error":"#REF!"},{"$error":"#REF!"},{"$error":"#REF!"},{"$error":"#REF!"},{"$error":"#REF!"},{"$error":"#REF!"},{"$error":"#REF!"},{"$error":"#REF!"},{"$error":"#REF!"},{"$error":"#REF!"},{"$error":"#REF!"},null,null,null,null,null,null,null,null,null,null,null,null,null,null,null,null,8]
[9,{"$error":"#REF!"},{"$error":"#REF!"},{"$error":"#REF!"},{"$error":"#REF!"},{"$error":"#REF!"},{"$error":"#REF!"},{"$error":"#REF!"},{"$error":"#REF!"},{"$error":"#REF!"},{"$error":"#REF!"},{"$error":"#REF!"},{"$error":"#REF!"},{"$error":"#REF!"},null,null,null,null,null,null,null,null,null,null,null,null,null,null,null,null,9]
[10,{"$error":"#REF!"},{"$error":"#REF!"},{"$error":"#REF!"},{"$error":"#REF!"},{"$error":"#REF!"},{"$error":"#REF!"},{"$error":"#REF!"},{"$error":"#REF!"},{"$error":"#REF!"},{"$error":"#REF!"},{"$error":"#REF!"},{"$error":"#REF!"},{"$error":"#REF!"},null,null,null,null,null,null,null,null,null,null,null,null,null,null,null,null,10]
[11,{"$error":"#REF!"},{"$error":"#REF!"},{"$error":"#REF!"},{"$error":"#REF!"},{"$error":"#REF!"},{"$error":"#REF!"},{"$error":"#REF!"},{"$error":"#REF!"},{"$error":"#REF!"},{"$error":"#REF!"},{"$error":"#REF!"},{"$error":"#REF!"},{"$error":"#REF!"},null,null,null,null,null,null,null,null,null,null,null,null,null,null,null,null,11]
[12,{"$error":"#REF!"},{"$error":"#REF!"},{"$error":"#REF!"},{"$error":"#REF!"},{"$error":"#REF!"},{"$error":"#REF!"},{"$error":"#REF!"},{"$error":"#REF!"},{"$error":"#REF!"},{"$error":"#REF!"},{"$error":"#REF!"},{"$error":"#REF!"},{"$error":"#REF!"},null,null,null,null,null,null,null,null,null,{"$f":"SUM(H97:H108)","v":{"$error":"#REF!"}},{"$f":"SUM(S97:S108)","v":0},{"$f":"SUM(D97:D108)","v":{"$error":"#REF!"}},{"$f":"SUM(E97:E108)","v":{"$error":"#REF!"}},{"$f":"SUM(F97:F108)","v":{"$error":"#REF!"}},{"$f":"SUM(G97:G108)","v":{"$error":"#REF!"}},null,12]
[13,{"$error":"#REF!"},{"$error":"#REF!"},{"$error":"#REF!"},{"$error":"#REF!"},{"$error":"#REF!"},{"$error":"#REF!"},{"$error":"#REF!"},{"$error":"#REF!"},{"$error":"#REF!"},{"$error":"#REF!"},{"$error":"#REF!"},{"$error":"#REF!"},{"$error":"#REF!"},null,null,null,null,null,null,null,null,null,null,{"$f":"SUM(W97:W108)","v":0},null,{"$f":"Z108-AA108","v":{"$error":"#REF!"}},null,null,null,13]
[14,{"$error":"#REF!"},{"$error":"#REF!"},{"$error":"#REF!"},{"$error":"#REF!"},{"$error":"#REF!"},{"$error":"#REF!"},{"$error":"#REF!"},{"$error":"#REF!"},{"$error":"#REF!"},{"$error":"#REF!"},{"$error":"#REF!"},{"$error":"#REF!"},{"$error":"#REF!"},null,null,null,null,null,null,null,null,null,null,null,null,{"$f":"AA109-AB108","v":{"$error":"#REF!"}},null,null,null,14]
[15,{"$error":"#REF!"},{"$error":"#REF!"},{"$error":"#REF!"},{"$error":"#REF!"},{"$error":"#REF!"},{"$error":"#REF!"},{"$error":"#REF!"},{"$error":"#REF!"},{"$error":"#REF!"},{"$error":"#REF!"},{"$error":"#REF!"},{"$error":"#REF!"},{"$error":"#REF!"},null,null,null,null,null,null,null,null,null,null,null,null,{"$f":"AA110-AC108","v":{"$error":"#REF!"}},null,null,null,15]
[16,{"$error":"#REF!"},{"$error":"#REF!"},{"$error":"#REF!"},{"$error":"#REF!"},{"$error":"#REF!"},{"$error":"#REF!"},{"$error":"#REF!"},{"$error":"#REF!"},{"$error":"#REF!"},{"$error":"#REF!"},{"$error":"#REF!"},{"$error":"#REF!"},{"$error":"#REF!"},null,null,null,null,null,null,null,null,null,null,null,null,null,null,null,null,16]
[17,{"$error":"#REF!"},{"$error":"#REF!"},{"$error":"#REF!"},{"$error":"#REF!"},{"$error":"#REF!"},{"$error":"#REF!"},{"$error":"#REF!"},{"$error":"#REF!"},{"$error":"#REF!"},{"$error":"#REF!"},{"$error":"#REF!"},{"$error":"#REF!"},{"$error":"#REF!"},null,null,null,null,null,null,null,null,null,null,null,null,null,null,null,null,17]
[18,{"$error":"#REF!"},{"$error":"#REF!"},{"$error":"#REF!"},{"$error":"#REF!"},{"$error":"#REF!"},{"$error":"#REF!"},{"$error":"#REF!"},{"$error":"#REF!"},{"$error":"#REF!"},{"$error":"#REF!"},{"$error":"#REF!"},{"$error":"#REF!"},{"$error":"#REF!"},null,null,null,null,null,null,null,null,null,null,null,null,null,null,null,null,18]
[19,{"$error":"#REF!"},{"$error":"#REF!"},{"$error":"#REF!"},{"$error":"#REF!"},{"$error":"#REF!"},{"$error":"#REF!"},{"$error":"#REF!"},{"$error":"#REF!"},{"$error":"#REF!"},{"$error":"#REF!"},{"$error":"#REF!"},{"$error":"#REF!"},{"$error":"#REF!"},null,null,null,null,null,null,null,null,null,null,null,null,null,null,null,null,19]
[20,{"$error":"#REF!"},{"$error":"#REF!"},{"$error":"#REF!"},{"$error":"#REF!"},{"$error":"#REF!"},{"$error":"#REF!"},{"$error":"#REF!"},{"$error":"#REF!"},{"$error":"#REF!"},{"$error":"#REF!"},{"$error":"#REF!"},{"$error":"#REF!"},{"$error":"#REF!"},null,null,null,null,null,null,null,null,null,null,null,null,null,null,null,null,20]
[21,{"$error":"#REF!"},{"$error":"#REF!"},{"$error":"#REF!"},{"$error":"#REF!"},{"$error":"#REF!"},{"$error":"#REF!"},{"$error":"#REF!"},{"$error":"#REF!"},{"$error":"#REF!"},{"$error":"#REF!"},{"$error":"#REF!"},{"$error":"#REF!"},{"$error":"#REF!"},null,null,null,null,null,null,null,null,null,null,null,null,null,null,null,null,21]
[22,{"$error":"#REF!"},{"$error":"#REF!"},{"$error":"#REF!"},{"$error":"#REF!"},{"$error":"#REF!"},{"$error":"#REF!"},{"$error":"#REF!"},{"$error":"#REF!"},{"$error":"#REF!"},{"$error":"#REF!"},{"$error":"#REF!"},{"$error":"#REF!"},{"$error":"#REF!"},null,null,null,null,null,null,null,null,null,null,null,null,null,null,null,null,22]
[23,{"$error":"#REF!"},{"$error":"#REF!"},{"$error":"#REF!"},{"$error":"#REF!"},{"$error":"#REF!"},{"$error":"#REF!"},{"$error":"#REF!"},{"$error":"#REF!"},{"$error":"#REF!"},{"$error":"#REF!"},{"$error":"#REF!"},{"$error":"#REF!"},{"$error":"#REF!"},null,null,null,null,null,null,null,null,null,null,null,null,null,null,null,null,23]
[24,{"$error":"#REF!"},{"$error":"#REF!"},{"$error":"#REF!"},{"$error":"#REF!"},{"$error":"#REF!"},{"$error":"#REF!"},{"$error":"#REF!"},{"$error":"#REF!"},{"$error":"#REF!"},{"$error":"#REF!"},{"$error":"#REF!"},{"$error":"#REF!"},{"$error":"#REF!"},null,null,null,null,null,null,null,null,null,{"$f":"SUM(H109:H120)","v":{"$error":"#REF!"}},{"$f":"SUM(S109:S120)","v":0},{"$f":"SUM(D109:D120)","v":{"$error":"#REF!"}},{"$f":"SUM(E109:E120)","v":{"$error":"#REF!"}},{"$f":"SUM(F109:F120)","v":{"$error":"#REF!"}},{"$f":"SUM(G109:G120)","v":{"$error":"#REF!"}},null,24]
[25,{"$error":"#REF!"},{"$error":"#REF!"},{"$error":"#REF!"},{"$error":"#REF!"},{"$error":"#REF!"},{"$error":"#REF!"},{"$error":"#REF!"},{"$error":"#REF!"},{"$error":"#REF!"},{"$error":"#REF!"},{"$error":"#REF!"},{"$error":"#REF!"},{"$error":"#REF!"},null,null,null,null,null,null,null,null,null,null,{"$f":"Y108+Y120","v":0},null,null,null,null,null,25]
[26,{"$error":"#REF!"},{"$error":"#REF!"},{"$error":"#REF!"},{"$error":"#REF!"},{"$error":"#REF!"},{"$error":"#REF!"},{"$error":"#REF!"},{"$error":"#REF!"},{"$error":"#REF!"},{"$error":"#REF!"},{"$error":"#REF!"},{"$error":"#REF!"},{"$error":"#REF!"},null,null,null,null,null,null,null,null,null,null,null,null,null,null,null,null,26]
[27,{"$error":"#REF!"},{"$error":"#REF!"},{"$error":"#REF!"},{"$error":"#REF!"},{"$error":"#REF!"},{"$error":"#REF!"},{"$error":"#REF!"},{"$error":"#REF!"},{"$error":"#REF!"},{"$error":"#REF!"},{"$error":"#REF!"},{"$error":"#REF!"},{"$error":"#REF!"},null,null,null,null,null,null,null,null,null,null,null,null,null,null,null,null,27]
[28,{"$error":"#REF!"},{"$error":"#REF!"},{"$error":"#REF!"},{"$error":"#REF!"},{"$error":"#REF!"},{"$error":"#REF!"},{"$error":"#REF!"},{"$error":"#REF!"},{"$error":"#REF!"},{"$error":"#REF!"},{"$error":"#REF!"},{"$error":"#REF!"},{"$error":"#REF!"},null,null,null,null,null,null,null,null,null,null,null,null,null,null,null,null,28]
[29,{"$error":"#REF!"},{"$error":"#REF!"},{"$error":"#REF!"},{"$error":"#REF!"},{"$error":"#REF!"},{"$error":"#REF!"},{"$error":"#REF!"},{"$error":"#REF!"},{"$error":"#REF!"},{"$error":"#REF!"},{"$error":"#REF!"},{"$error":"#REF!"},{"$error":"#REF!"},null,null,null,null,null,null,null,null,null,null,null,null,null,null,null,null,29]
[30,{"$error":"#REF!"},{"$error":"#REF!"},{"$error":"#REF!"},{"$error":"#REF!"},{"$error":"#REF!"},{"$error":"#REF!"},{"$error":"#REF!"},{"$error":"#REF!"},{"$error":"#REF!"},{"$error":"#REF!"},{"$error":"#REF!"},{"$error":"#REF!"},{"$error":"#REF!"},null,null,null,null,null,null,null,null,null,null,null,null,null,null,null,null,30]
[31,{"$error":"#REF!"},{"$error":"#REF!"},{"$error":"#REF!"},{"$error":"#REF!"},{"$error":"#REF!"},{"$error":"#REF!"},{"$error":"#REF!"},{"$error":"#REF!"},{"$error":"#REF!"},{"$error":"#REF!"},{"$error":"#REF!"},{"$error":"#REF!"},{"$error":"#REF!"},null,null,null,null,null,null,null,null,null,null,null,null,null,null,null,null,31]
[32,{"$error":"#REF!"},{"$error":"#REF!"},{"$error":"#REF!"},{"$error":"#REF!"},{"$error":"#REF!"},{"$error":"#REF!"},{"$error":"#REF!"},{"$error":"#REF!"},{"$error":"#REF!"},{"$error":"#REF!"},{"$error":"#REF!"},{"$error":"#REF!"},{"$error":"#REF!"},null,null,null,null,null,null,null,null,null,null,null,null,null,null,null,null,32]
[33,{"$error":"#REF!"},{"$error":"#REF!"},{"$error":"#REF!"},{"$error":"#REF!"},{"$error":"#REF!"},{"$error":"#REF!"},{"$error":"#REF!"},{"$error":"#REF!"},{"$error":"#REF!"},{"$error":"#REF!"},{"$error":"#REF!"},{"$error":"#REF!"},{"$error":"#REF!"},null,null,null,null,null,null,null,null,null,null,null,null,null,null,null,null,33]
[34,{"$error":"#REF!"},{"$error":"#REF!"},{"$error":"#REF!"},{"$error":"#REF!"},{"$error":"#REF!"},{"$error":"#REF!"},{"$error":"#REF!"},{"$error":"#REF!"},{"$error":"#REF!"},{"$error":"#REF!"},{"$error":"#REF!"},{"$error":"#REF!"},{"$error":"#REF!"},null,null,null,null,null,null,null,null,null,null,null,null,null,null,null,null,34]
[35,{"$error":"#REF!"},{"$error":"#REF!"},{"$error":"#REF!"},{"$error":"#REF!"},{"$error":"#REF!"},{"$error":"#REF!"},{"$error":"#REF!"},{"$error":"#REF!"},{"$error":"#REF!"},{"$error":"#REF!"},{"$error":"#REF!"},{"$error":"#REF!"},{"$error":"#REF!"},null,null,null,null,null,null,null,null,null,null,null,null,null,null,null,null,35]
[36,{"$error":"#REF!"},{"$error":"#REF!"},{"$error":"#REF!"},{"$error":"#REF!"},{"$error":"#REF!"},{"$error":"#REF!"},{"$error":"#REF!"},{"$error":"#REF!"},{"$error":"#REF!"},{"$error":"#REF!"},{"$error":"#REF!"},{"$error":"#REF!"},{"$error":"#REF!"},null,null,null,null,null,null,null,null,null,{"$f":"SUM(H121:H132)","v":{"$error":"#REF!"}},{"$f":"SUM(S121:S132)","v":0},null,null,null,null,null,36]
[37,{"$error":"#REF!"},{"$error":"#REF!"},{"$error":"#REF!"},{"$error":"#REF!"},{"$error":"#REF!"},{"$error":"#REF!"},{"$error":"#REF!"},{"$error":"#REF!"},{"$error":"#REF!"},{"$error":"#REF!"},{"$error":"#REF!"},{"$error":"#REF!"},{"$error":"#REF!"},null,null,null,null,null,null,null,null,null,null,null,null,null,null,null,null,37]
[38,{"$error":"#REF!"},{"$error":"#REF!"},{"$error":"#REF!"},{"$error":"#REF!"},{"$error":"#REF!"},{"$error":"#REF!"},{"$error":"#REF!"},{"$error":"#REF!"},{"$error":"#REF!"},{"$error":"#REF!"},{"$error":"#REF!"},{"$error":"#REF!"},{"$error":"#REF!"},null,null,null,null,null,null,null,null,null,null,null,null,null,null,null,null,38]
[39,{"$error":"#REF!"},{"$error":"#REF!"},{"$error":"#REF!"},{"$error":"#REF!"},{"$error":"#REF!"},{"$error":"#REF!"},{"$error":"#REF!"},{"$error":"#REF!"},{"$error":"#REF!"},{"$error":"#REF!"},{"$error":"#REF!"},{"$error":"#REF!"},{"$error":"#REF!"},null,null,null,null,null,null,null,null,null,null,null,null,null,null,null,null,39]
[40,{"$error":"#REF!"},{"$error":"#REF!"},{"$error":"#REF!"},{"$error":"#REF!"},{"$error":"#REF!"},{"$error":"#REF!"},{"$error":"#REF!"},{"$error":"#REF!"},{"$error":"#REF!"},{"$error":"#REF!"},{"$error":"#REF!"},{"$error":"#REF!"},{"$error":"#REF!"},null,null,null,null,null,null,null,null,null,null,null,null,null,null,null,null,40]
[41,{"$error":"#REF!"},{"$error":"#REF!"},{"$error":"#REF!"},{"$error":"#REF!"},{"$error":"#REF!"},{"$error":"#REF!"},{"$error":"#REF!"},{"$error":"#REF!"},{"$error":"#REF!"},{"$error":"#REF!"},{"$error":"#REF!"},{"$error":"#REF!"},{"$error":"#REF!"},null,null,null,null,null,null,null,null,null,null,null,null,null,null,null,null,41]
[42,{"$error":"#REF!"},{"$error":"#REF!"},{"$error":"#REF!"},{"$error":"#REF!"},{"$error":"#REF!"},{"$error":"#REF!"},{"$error":"#REF!"},{"$error":"#REF!"},{"$error":"#REF!"},{"$error":"#REF!"},{"$error":"#REF!"},{"$error":"#REF!"},{"$error":"#REF!"},null,null,null,null,null,null,null,null,null,null,null,null,null,null,null,null,42]
[43,{"$error":"#REF!"},{"$error":"#REF!"},{"$error":"#REF!"},{"$error":"#REF!"},{"$error":"#REF!"},{"$error":"#REF!"},{"$error":"#REF!"},{"$error":"#REF!"},{"$error":"#REF!"},{"$error":"#REF!"},{"$error":"#REF!"},{"$error":"#REF!"},{"$error":"#REF!"},null,null,null,null,null,null,null,null,null,null,null,null,null,null,null,null,43]
[44,{"$error":"#REF!"},{"$error":"#REF!"},{"$error":"#REF!"},{"$error":"#REF!"},{"$error":"#REF!"},{"$error":"#REF!"},{"$error":"#REF!"},{"$error":"#REF!"},{"$error":"#REF!"},{"$error":"#REF!"},{"$error":"#REF!"},{"$error":"#REF!"},{"$error":"#REF!"},null,null,null,null,null,null,null,null,null,null,null,null,null,null,null,null,44]
[45,{"$error":"#REF!"},{"$error":"#REF!"},{"$error":"#REF!"},{"$error":"#REF!"},{"$error":"#REF!"},{"$error":"#REF!"},{"$error":"#REF!"},{"$error":"#REF!"},{"$error":"#REF!"},{"$error":"#REF!"},{"$error":"#REF!"},{"$error":"#REF!"},{"$error":"#REF!"},null,null,null,null,null,null,null,null,null,null,null,null,null,null,null,null,45]
[46,{"$error":"#REF!"},{"$error":"#REF!"},{"$error":"#REF!"},{"$error":"#REF!"},{"$error":"#REF!"},{"$error":"#REF!"},{"$error":"#REF!"},{"$error":"#REF!"},{"$error":"#REF!"},{"$error":"#REF!"},{"$error":"#REF!"},{"$error":"#REF!"},{"$error":"#REF!"},null,null,null,null,null,null,null,null,null,null,null,null,null,null,null,null,46]
[47,{"$error":"#REF!"},{"$error":"#REF!"},{"$error":"#REF!"},{"$error":"#REF!"},{"$error":"#REF!"},{"$error":"#REF!"},{"$error":"#REF!"},{"$error":"#REF!"},{"$error":"#REF!"},{"$error":"#REF!"},{"$error":"#REF!"},{"$error":"#REF!"},{"$error":"#REF!"},null,null,null,null,null,null,null,null,null,null,null,null,null,null,null,null,47]
[48,{"$error":"#REF!"},{"$error":"#REF!"},{"$error":"#REF!"},{"$error":"#REF!"},{"$error":"#REF!"},{"$error":"#REF!"},{"$error":"#REF!"},{"$error":"#REF!"},{"$error":"#REF!"},{"$error":"#REF!"},{"$error":"#REF!"},{"$error":"#REF!"},{"$error":"#REF!"},null,null,null,null,null,null,null,null,null,{"$f":"SUM(H133:H144)","v":{"$error":"#REF!"}},null,null,null,null,null,null,48]
[49,{"$error":"#REF!"},{"$error":"#REF!"},{"$error":"#REF!"},{"$error":"#REF!"},{"$error":"#REF!"},{"$error":"#REF!"},{"$error":"#REF!"},{"$error":"#REF!"},{"$error":"#REF!"},{"$error":"#REF!"},{"$error":"#REF!"},{"$error":"#REF!"},{"$error":"#REF!"},null,null,null,null,null,null,null,null,null,null,null,null,null,null,null,null,49]
[50,{"$error":"#REF!"},{"$error":"#REF!"},{"$error":"#REF!"},{"$error":"#REF!"},{"$error":"#REF!"},{"$error":"#REF!"},{"$error":"#REF!"},{"$error":"#REF!"},{"$error":"#REF!"},{"$error":"#REF!"},{"$error":"#REF!"},{"$error":"#REF!"},{"$error":"#REF!"},null,null,null,null,null,null,null,null,null,null,null,null,null,null,null,null,50]
[51,{"$error":"#REF!"},{"$error":"#REF!"},{"$error":"#REF!"},{"$error":"#REF!"},{"$error":"#REF!"},{"$error":"#REF!"},{"$error":"#REF!"},{"$error":"#REF!"},{"$error":"#REF!"},{"$error":"#REF!"},{"$error":"#REF!"},{"$error":"#REF!"},{"$error":"#REF!"},null,null,null,null,null,null,null,null,null,null,null,null,null,null,null,null,51]
[52,{"$error":"#REF!"},{"$error":"#REF!"},{"$error":"#REF!"},{"$error":"#REF!"},{"$error":"#REF!"},{"$error":"#REF!"},{"$error":"#REF!"},{"$error":"#REF!"},{"$error":"#REF!"},{"$error":"#REF!"},{"$error":"#REF!"},{"$error":"#REF!"},{"$error":"#REF!"},null,null,null,null,null,null,null,null,null,null,null,null,null,null,null,null,52]
[53,{"$error":"#REF!"},{"$error":"#REF!"},{"$error":"#REF!"},{"$error":"#REF!"},{"$error":"#REF!"},{"$error":"#REF!"},{"$error":"#REF!"},{"$error":"#REF!"},{"$error":"#REF!"},{"$error":"#REF!"},{"$error":"#REF!"},{"$error":"#REF!"},{"$error":"#REF!"},null,null,null,null,null,null,null,null,null,null,null,null,null,null,null,null,53]
[54,{"$error":"#REF!"},{"$error":"#REF!"},{"$error":"#REF!"},{"$error":"#REF!"},{"$error":"#REF!"},{"$error":"#REF!"},{"$error":"#REF!"},{"$error":"#REF!"},{"$error":"#REF!"},{"$error":"#REF!"},{"$error":"#REF!"},{"$error":"#REF!"},{"$error":"#REF!"},null,null,null,null,null,null,null,null,null,null,null,null,null,null,null,null,54]
[55,{"$error":"#REF!"},{"$error":"#REF!"},{"$error":"#REF!"},{"$error":"#REF!"},{"$error":"#REF!"},{"$error":"#REF!"},{"$error":"#REF!"},{"$error":"#REF!"},{"$error":"#REF!"},{"$error":"#REF!"},{"$error":"#REF!"},{"$error":"#REF!"},{"$error":"#REF!"},null,null,null,null,null,null,null,null,null,null,null,null,null,null,null,null,55]
[56,{"$error":"#REF!"},{"$error":"#REF!"},{"$error":"#REF!"},{"$error":"#REF!"},{"$error":"#REF!"},{"$error":"#REF!"},{"$error":"#REF!"},{"$error":"#REF!"},{"$error":"#REF!"},{"$error":"#REF!"},{"$error":"#REF!"},{"$error":"#REF!"},{"$error":"#REF!"},null,null,null,null,null,null,null,null,null,null,null,null,null,null,null,null,56]
[57,{"$error":"#REF!"},{"$error":"#REF!"},{"$error":"#REF!"},{"$error":"#REF!"},{"$error":"#REF!"},{"$error":"#REF!"},{"$error":"#REF!"},{"$error":"#REF!"},{"$error":"#REF!"},{"$error":"#REF!"},{"$error":"#REF!"},{"$error":"#REF!"},{"$error":"#REF!"},null,null,null,null,null,null,null,null,null,null,null,null,null,null,null,null,57]
[58,{"$error":"#REF!"},{"$error":"#REF!"},{"$error":"#REF!"},{"$error":"#REF!"},{"$error":"#REF!"},{"$error":"#REF!"},{"$error":"#REF!"},{"$error":"#REF!"},{"$error":"#REF!"},{"$error":"#REF!"},{"$error":"#REF!"},{"$error":"#REF!"},{"$error":"#REF!"},null,null,null,null,null,null,null,null,null,null,null,null,null,null,null,null,58]
[59,{"$error":"#REF!"},{"$error":"#REF!"},{"$error":"#REF!"},{"$error":"#REF!"},{"$error":"#REF!"},{"$error":"#REF!"},{"$error":"#REF!"},{"$error":"#REF!"},{"$error":"#REF!"},{"$error":"#REF!"},{"$error":"#REF!"},{"$error":"#REF!"},{"$error":"#REF!"},null,null,null,null,null,null,null,null,null,null,null,null,null,null,null,null,59]
[60,{"$error":"#REF!"},{"$error":"#REF!"},{"$error":"#REF!"},{"$error":"#REF!"},{"$error":"#REF!"},{"$error":"#REF!"},{"$error":"#REF!"},{"$error":"#REF!"},{"$error":"#REF!"},{"$error":"#REF!"},{"$error":"#REF!"},{"$error":"#REF!"},{"$error":"#REF!"},null,null,null,null,null,null,null,null,null,{"$f":"SUM(H145:H156)","v":{"$error":"#REF!"}},null,null,null,null,null,null,60]
[61,{"$error":"#REF!"},{"$error":"#REF!"},{"$error":"#REF!"},{"$error":"#REF!"},{"$error":"#REF!"},{"$error":"#REF!"},{"$error":"#REF!"},{"$error":"#REF!"},{"$error":"#REF!"},{"$error":"#REF!"},{"$error":"#REF!"},{"$error":"#REF!"},{"$error":"#REF!"}]
[62,{"$error":"#REF!"},{"$error":"#REF!"},{"$error":"#REF!"},{"$error":"#REF!"},{"$error":"#REF!"},{"$error":"#REF!"},{"$error":"#REF!"},{"$error":"#REF!"},{"$error":"#REF!"},{"$error":"#REF!"},{"$error":"#REF!"},{"$error":"#REF!"},{"$error":"#REF!"}]
[63,{"$error":"#REF!"},{"$error":"#REF!"},{"$error":"#REF!"},{"$error":"#REF!"},{"$error":"#REF!"},{"$error":"#REF!"},{"$error":"#REF!"},{"$error":"#REF!"},{"$error":"#REF!"},{"$error":"#REF!"},{"$error":"#REF!"},{"$error":"#REF!"},{"$error":"#REF!"}]
[64,{"$error":"#REF!"},{"$error":"#REF!"},{"$error":"#REF!"},{"$error":"#REF!"},{"$error":"#REF!"},{"$error":"#REF!"},{"$error":"#REF!"},{"$error":"#REF!"},{"$error":"#REF!"},{"$error":"#REF!"},{"$error":"#REF!"},{"$error":"#REF!"},{"$error":"#REF!"}]
[65,{"$error":"#REF!"},{"$error":"#REF!"},{"$f":"$G$49","v":{"$error":"#REF!"}},{"$error":"#REF!"},{"$error":"#REF!"},{"$error":"#REF!"},{"$error":"#REF!"},{"$error":"#REF!"},{"$error":"#REF!"},{"$error":"#REF!"},{"$error":"#REF!"},{"$error":"#REF!"},{"$error":"#REF!"}]
[66,{"$error":"#REF!"},{"$f":"B162","v":{"$error":"#REF!"}},{"$error":"#REF!"},{"$error":"#REF!"},{"$f":"+$C$80+$H$80","v":{"$error":"#REF!"}},{"$f":"+$C$78+$H$78","v":{"$error":"#REF!"}},{"$f":"+$C$76+$C$84","v":{"$error":"#REF!"}},{"$f":"D162-E162-F162-G162-H162","v":{"$error":"#REF!"}},{"$error":"#REF!"},{"$error":"#REF!"},{"$error":"#REF!"},{"$error":"#REF!"},{"$f":"M162-K162","v":{"$error":"#REF!"}}]
[67,{"$f":"DATE(YEAR(B162),MONTH(B162)+1,DAY(B162))","v":{"$error":"#REF!"}},{"$error":"#REF!"},{"$error":"#REF!"},{"$f":"+$C$82+$H$82","v":{"$error":"#REF!"}},{"$error":"#REF!"},{"$error":"#REF!"},{"$error":"#REF!"},{"$error":"#REF!"},{"$error":"#REF!"},{"$error":"#REF!"},{"$f":"M162+I163","v":{"$error":"#REF!"}},{"$f":"L163*(1+$C$44)","v":{"$error":"#REF!"}},{"$error":"#REF!"}]
[68,{"$error":"#REF!"},{"$error":"#REF!"},{"$error":"#REF!"},{"$error":"#REF!"},{"$error":"#REF!"},{"$error":"#REF!"},{"$error":"#REF!"},{"$error":"#REF!"},{"$f":"+K163+I164","v":{"$error":"#REF!"}},{"$error":"#REF!"},{"$error":"#REF!"},{"$error":"#REF!"},{"$error":"#REF!"}]
[69,{"$error":"#REF!"},{"$error":"#REF!"},{"$error":"#REF!"},{"$error":"#REF!"},{"$error":"#REF!"},{"$error":"#REF!"},{"$error":"#REF!"},{"$error":"#REF!"},{"$error":"#REF!"},{"$f":"+(1+$C$42)*J165","v":{"$error":"#REF!"}},{"$error":"#REF!"},{"$error":"#REF!"},{"$error":"#REF!"}]
[70,{"$error":"#REF!"},{"$error":"#REF!"},{"$error":"#REF!"},{"$error":"#REF!"},{"$error":"#REF!"},{"$error":"#REF!"},{"$error":"#REF!"},{"$error":"#REF!"},{"$error":"#REF!"},{"$error":"#REF!"},{"$error":"#REF!"},{"$error":"#REF!"},{"$error":"#REF!"}]
[71,{"$error":"#REF!"},{"$error":"#REF!"},{"$error":"#REF!"},{"$error":"#REF!"},{"$error":"#REF!"},{"$error":"#REF!"},{"$error":"#REF!"},{"$error":"#REF!"},{"$error":"#REF!"},{"$error":"#REF!"},{"$error":"#REF!"},{"$error":"#REF!"},{"$error":"#REF!"}]
[72,{"$error":"#REF!"},{"$error":"#REF!"},{"$error":"#REF!"},{"$error":"#REF!"},{"$error":"#REF!"},{"$error":"#REF!"},{"$error":"#REF!"},{"$error":"#REF!"},{"$error":"#REF!"},{"$error":"#REF!"},{"$error":"#REF!"},{"$error":"#REF!"},{"$error":"#REF!"}]
[73,{"$error":"#REF!"},{"$error":"#REF!"},{"$error":"#REF!"},{"$error":"#REF!"},{"$error":"#REF!"},{"$error":"#REF!"},{"$error":"#REF!"},{"$error":"#REF!"},{"$error":"#REF!"},{"$error":"#REF!"},{"$error":"#REF!"},{"$error":"#REF!"},{"$error":"#REF!"}]
[74,{"$error":"#REF!"},{"$error":"#REF!"},{"$error":"#REF!"},{"$error":"#REF!"},{"$error":"#REF!"},{"$error":"#REF!"},{"$error":"#REF!"},{"$error":"#REF!"},{"$error":"#REF!"},{"$error":"#REF!"},{"$error":"#REF!"},{"$error":"#REF!"},{"$error":"#REF!"}]
[75,{"$error":"#REF!"},{"$error":"#REF!"},{"$error":"#REF!"},{"$error":"#REF!"},{"$error":"#REF!"},{"$error":"#REF!"},{"$error":"#REF!"},{"$error":"#REF!"},{"$error":"#REF!"},{"$error":"#REF!"},{"$error":"#REF!"},{"$error":"#REF!"},{"$error":"#REF!"}]
[76,{"$error":"#REF!"},{"$error":"#REF!"},{"$error":"#REF!"},{"$error":"#REF!"},{"$error":"#REF!"},{"$error":"#REF!"},{"$error":"#REF!"},{"$error":"#REF!"},{"$error":"#REF!"},{"$error":"#REF!"},{"$error":"#REF!"},{"$error":"#REF!"},{"$error":"#REF!"}]
[77,{"$error":"#REF!"},{"$error":"#REF!"},{"$error":"#REF!"},{"$error":"#REF!"},{"$error":"#REF!"},{"$error":"#REF!"},{"$error":"#REF!"},{"$error":"#REF!"},{"$error":"#REF!"},{"$error":"#REF!"},{"$error":"#REF!"},{"$error":"#REF!"},{"$error":"#REF!"}]
[78,{"$error":"#REF!"},{"$error":"#REF!"},{"$error":"#REF!"},{"$error":"#REF!"},{"$error":"#REF!"},{"$error":"#REF!"},{"$error":"#REF!"},{"$error":"#REF!"},{"$error":"#REF!"},{"$error":"#REF!"},{"$error":"#REF!"},{"$error":"#REF!"},{"$error":"#REF!"}]
[79,{"$error":"#REF!"},{"$error":"#REF!"},{"$error":"#REF!"},{"$error":"#REF!"},{"$error":"#REF!"},{"$error":"#REF!"},{"$error":"#REF!"},{"$error":"#REF!"},{"$error":"#REF!"},{"$error":"#REF!"},{"$error":"#REF!"},{"$error":"#REF!"},{"$error":"#REF!"}]
[80,{"$error":"#REF!"},{"$error":"#REF!"},{"$error":"#REF!"},{"$error":"#REF!"},{"$error":"#REF!"},{"$error":"#REF!"},{"$error":"#REF!"},{"$error":"#REF!"},{"$error":"#REF!"},{"$error":"#REF!"},{"$error":"#REF!"},{"$error":"#REF!"},{"$error":"#REF!"}]
[81,{"$error":"#REF!"},{"$error":"#REF!"},{"$error":"#REF!"},{"$error":"#REF!"},{"$error":"#REF!"},{"$error":"#REF!"},{"$error":"#REF!"},{"$error":"#REF!"},{"$error":"#REF!"},{"$error":"#REF!"},{"$error":"#REF!"},{"$error":"#REF!"},{"$error":"#REF!"}]
[82,{"$error":"#REF!"},{"$error":"#REF!"},{"$error":"#REF!"},{"$error":"#REF!"},{"$error":"#REF!"},{"$error":"#REF!"},{"$error":"#REF!"},{"$error":"#REF!"},{"$error":"#REF!"},{"$error":"#REF!"},{"$error":"#REF!"},{"$error":"#REF!"},{"$error":"#REF!"}]
[83,{"$error":"#REF!"},{"$error":"#REF!"},{"$error":"#REF!"},{"$error":"#REF!"},{"$error":"#REF!"},{"$error":"#REF!"},{"$error":"#REF!"},{"$error":"#REF!"},{"$error":"#REF!"},{"$error":"#REF!"},{"$error":"#REF!"},{"$error":"#REF!"},{"$error":"#REF!"}]
[84,{"$error":"#REF!"},{"$error":"#REF!"},{"$error":"#REF!"},{"$error":"#REF!"},{"$error":"#REF!"},{"$error":"#REF!"},{"$error":"#REF!"},{"$error":"#REF!"},{"$error":"#REF!"},{"$error":"#REF!"},{"$error":"#REF!"},{"$error":"#REF!"},{"$error":"#REF!"}]
[85,{"$error":"#REF!"},{"$error":"#REF!"},{"$error":"#REF!"},{"$error":"#REF!"},{"$error":"#REF!"},{"$error":"#REF!"},{"$error":"#REF!"},{"$error":"#REF!"},{"$error":"#REF!"},{"$error":"#REF!"},{"$error":"#REF!"},{"$error":"#REF!"},{"$error":"#REF!"}]
[86,{"$error":"#REF!"},{"$error":"#REF!"},{"$error":"#REF!"},{"$error":"#REF!"},{"$error":"#REF!"},{"$error":"#REF!"},{"$error":"#REF!"},{"$error":"#REF!"},{"$error":"#REF!"},{"$error":"#REF!"},{"$error":"#REF!"},{"$error":"#REF!"},{"$error":"#REF!"}]
[87,{"$error":"#REF!"},{"$error":"#REF!"},{"$error":"#REF!"},{"$error":"#REF!"},{"$error":"#REF!"},{"$error":"#REF!"},{"$error":"#REF!"},{"$error":"#REF!"},{"$error":"#REF!"},{"$error":"#REF!"},{"$error":"#REF!"},{"$error":"#REF!"},{"$error":"#REF!"}]
[88,{"$error":"#REF!"},{"$error":"#REF!"},{"$error":"#REF!"},{"$error":"#REF!"},{"$error":"#REF!"},{"$error":"#REF!"},{"$error":"#REF!"},{"$error":"#REF!"},{"$error":"#REF!"},{"$error":"#REF!"},{"$error":"#REF!"},{"$error":"#REF!"},{"$error":"#REF!"}]
[89,{"$error":"#REF!"},{"$error":"#REF!"},{"$error":"#REF!"},{"$error":"#REF!"},{"$error":"#REF!"},{"$error":"#REF!"},{"$error":"#REF!"},{"$error":"#REF!"},{"$error":"#REF!"},{"$error":"#REF!"},{"$error":"#REF!"},{"$error":"#REF!"},{"$error":"#REF!"}]
[90,{"$error":"#REF!"},{"$error":"#REF!"},{"$error":"#REF!"},{"$error":"#REF!"},{"$error":"#REF!"},{"$error":"#REF!"},{"$error":"#REF!"},{"$error":"#REF!"},{"$error":"#REF!"},{"$error":"#REF!"},{"$error":"#REF!"},{"$error":"#REF!"},{"$error":"#REF!"}]
[91,{"$error":"#REF!"},{"$error":"#REF!"},{"$error":"#REF!"},{"$error":"#REF!"},{"$error":"#REF!"},{"$error":"#REF!"},{"$error":"#REF!"},{"$error":"#REF!"},{"$error":"#REF!"},{"$error":"#REF!"},{"$error":"#REF!"},{"$error":"#REF!"},{"$error":"#REF!"}]
[92,{"$error":"#REF!"},{"$error":"#REF!"},{"$error":"#REF!"},{"$error":"#REF!"},{"$error":"#REF!"},{"$error":"#REF!"},{"$error":"#REF!"},{"$error":"#REF!"},{"$error":"#REF!"},{"$error":"#REF!"},{"$error":"#REF!"},{"$error":"#REF!"},{"$error":"#REF!"}]
[93,{"$error":"#REF!"},{"$error":"#REF!"},{"$error":"#REF!"},{"$error":"#REF!"},{"$error":"#REF!"},{"$error":"#REF!"},{"$error":"#REF!"},{"$error":"#REF!"},{"$error":"#REF!"},{"$error":"#REF!"},{"$error":"#REF!"},{"$error":"#REF!"},{"$error":"#REF!"}]
[94,{"$error":"#REF!"},{"$error":"#REF!"},{"$error":"#REF!"},{"$error":"#REF!"},{"$error":"#REF!"},{"$error":"#REF!"},{"$error":"#REF!"},{"$error":"#REF!"},{"$error":"#REF!"},{"$error":"#REF!"},{"$error":"#REF!"},{"$error":"#REF!"},{"$error":"#REF!"}]
[95,{"$error":"#REF!"},{"$error":"#REF!"},{"$error":"#REF!"},{"$error":"#REF!"},{"$error":"#REF!"},{"$error":"#REF!"},{"$error":"#REF!"},{"$error":"#REF!"},{"$error":"#REF!"},{"$error":"#REF!"},{"$error":"#REF!"},{"$error":"#REF!"},{"$error":"#REF!"}]
[96,{"$error":"#REF!"},{"$error":"#REF!"},{"$error":"#REF!"},{"$error":"#REF!"},{"$error":"#REF!"},{"$error":"#REF!"},{"$error":"#REF!"},{"$error":"#REF!"},{"$error":"#REF!"},{"$error":"#REF!"},{"$error":"#REF!"},{"$error":"#REF!"},{"$error":"#REF!"}]
[97,{"$error":"#REF!"},{"$error":"#REF!"},{"$error":"#REF!"},{"$error":"#REF!"},{"$error":"#REF!"},{"$error":"#REF!"},{"$error":"#REF!"},{"$error":"#REF!"},{"$error":"#REF!"},{"$error":"#REF!"},{"$error":"#REF!"},{"$error":"#REF!"},{"$error":"#REF!"}]
[98,{"$error":"#REF!"},{"$error":"#REF!"},{"$error":"#REF!"},{"$error":"#REF!"},{"$error":"#REF!"},{"$error":"#REF!"},{"$error":"#REF!"},{"$error":"#REF!"},{"$error":"#REF!"},{"$error":"#REF!"},{"$error":"#REF!"},{"$error":"#REF!"},{"$error":"#REF!"}]
[99,{"$error":"#REF!"},{"$error":"#REF!"},{"$error":"#REF!"},{"$error":"#REF!"},{"$error":"#REF!"},{"$error":"#REF!"},{"$error":"#REF!"},{"$error":"#REF!"},{"$error":"#REF!"},{"$error":"#REF!"},{"$error":"#REF!"},{"$error":"#REF!"},{"$error":"#REF!"}]
[100,{"$error":"#REF!"},{"$error":"#REF!"},{"$error":"#REF!"},{"$error":"#REF!"},{"$error":"#REF!"},{"$error":"#REF!"},{"$error":"#REF!"},{"$error":"#REF!"},{"$error":"#REF!"},{"$error":"#REF!"},{"$error":"#REF!"},{"$error":"#REF!"},{"$error":"#REF!"}]
[101,{"$error":"#REF!"},{"$error":"#REF!"},{"$error":"#REF!"},{"$error":"#REF!"},{"$error":"#REF!"},{"$error":"#REF!"},{"$error":"#REF!"},{"$error":"#REF!"},{"$error":"#REF!"},{"$error":"#REF!"},{"$error":"#REF!"},{"$error":"#REF!"},{"$error":"#REF!"}]
[102,{"$error":"#REF!"},{"$error":"#REF!"},{"$error":"#REF!"},{"$error":"#REF!"},{"$error":"#REF!"},{"$error":"#REF!"},{"$error":"#REF!"},{"$error":"#REF!"},{"$error":"#REF!"},{"$error":"#REF!"},{"$error":"#REF!"},{"$error":"#REF!"},{"$error":"#REF!"}]
[103,{"$error":"#REF!"},{"$error":"#REF!"},{"$error":"#REF!"},{"$error":"#REF!"},{"$error":"#REF!"},{"$error":"#REF!"},{"$error":"#REF!"},{"$error":"#REF!"},{"$error":"#REF!"},{"$error":"#REF!"},{"$error":"#REF!"},{"$error":"#REF!"},{"$error":"#REF!"}]
[104,{"$error":"#REF!"},{"$error":"#REF!"},{"$error":"#REF!"},{"$error":"#REF!"},{"$error":"#REF!"},{"$error":"#REF!"},{"$error":"#REF!"},{"$error":"#REF!"},{"$error":"#REF!"},{"$error":"#REF!"},{"$error":"#REF!"},{"$error":"#REF!"},{"$error":"#REF!"}]
[105,{"$error":"#REF!"},{"$error":"#REF!"},{"$error":"#REF!"},{"$error":"#REF!"},{"$error":"#REF!"},{"$error":"#REF!"},{"$error":"#REF!"},{"$error":"#REF!"},{"$error":"#REF!"},{"$error":"#REF!"},{"$error":"#REF!"},{"$error":"#REF!"},{"$error":"#REF!"}]
[106,{"$error":"#REF!"},{"$error":"#REF!"},{"$error":"#REF!"},{"$error":"#REF!"},{"$error":"#REF!"},{"$error":"#REF!"},{"$error":"#REF!"},{"$error":"#REF!"},{"$error":"#REF!"},{"$error":"#REF!"},{"$error":"#REF!"},{"$error":"#REF!"},{"$error":"#REF!"}]
[107,{"$error":"#REF!"},{"$error":"#REF!"},{"$error":"#REF!"},{"$error":"#REF!"},{"$error":"#REF!"},{"$error":"#REF!"},{"$error":"#REF!"},{"$error":"#REF!"},{"$error":"#REF!"},{"$error":"#REF!"},{"$error":"#REF!"},{"$error":"#REF!"},{"$error":"#REF!"}]
[108,{"$error":"#REF!"},{"$error":"#REF!"},{"$error":"#REF!"},{"$error":"#REF!"},{"$error":"#REF!"},{"$error":"#REF!"},{"$error":"#REF!"},{"$error":"#REF!"},{"$error":"#REF!"},{"$error":"#REF!"},{"$error":"#REF!"},{"$error":"#REF!"},{"$error":"#REF!"}]
[109,{"$error":"#REF!"},{"$error":"#REF!"},{"$error":"#REF!"},{"$error":"#REF!"},{"$error":"#REF!"},{"$error":"#REF!"},{"$error":"#REF!"},{"$error":"#REF!"},{"$error":"#REF!"},{"$error":"#REF!"},{"$error":"#REF!"},{"$error":"#REF!"},{"$error":"#REF!"}]
[110,{"$error":"#REF!"},{"$error":"#REF!"},{"$error":"#REF!"},{"$error":"#REF!"},{"$error":"#REF!"},{"$error":"#REF!"},{"$error":"#REF!"},{"$error":"#REF!"},{"$error":"#REF!"},{"$error":"#REF!"},{"$error":"#REF!"},{"$error":"#REF!"},{"$error":"#REF!"}]
[111,{"$error":"#REF!"},{"$error":"#REF!"},{"$error":"#REF!"},{"$error":"#REF!"},{"$error":"#REF!"},{"$error":"#REF!"},{"$error":"#REF!"},{"$error":"#REF!"},{"$error":"#REF!"},{"$error":"#REF!"},{"$error":"#REF!"},{"$error":"#REF!"},{"$error":"#REF!"}]
[112,{"$error":"#REF!"},{"$error":"#REF!"},{"$error":"#REF!"},{"$error":"#REF!"},{"$error":"#REF!"},{"$error":"#REF!"},{"$error":"#REF!"},{"$error":"#REF!"},{"$error":"#REF!"},{"$error":"#REF!"},{"$error":"#REF!"},{"$error":"#REF!"},{"$error":"#REF!"}]
[113,{"$error":"#REF!"},{"$error":"#REF!"},{"$error":"#REF!"},{"$error":"#REF!"},{"$error":"#REF!"},{"$error":"#REF!"},{"$error":"#REF!"},{"$error":"#REF!"},{"$error":"#REF!"},{"$error":"#REF!"},{"$error":"#REF!"},{"$error":"#REF!"},{"$error":"#REF!"}]
[114,{"$error":"#REF!"},{"$error":"#REF!"},{"$error":"#REF!"},{"$error":"#REF!"},{"$error":"#REF!"},{"$error":"#REF!"},{"$error":"#REF!"},{"$error":"#REF!"},{"$error":"#REF!"},{"$error":"#REF!"},{"$error":"#REF!"},{"$error":"#REF!"},{"$error":"#REF!"}]
[115,{"$error":"#REF!"},{"$error":"#REF!"},{"$error":"#REF!"},{"$error":"#REF!"},{"$error":"#REF!"},{"$error":"#REF!"},{"$error":"#REF!"},{"$error":"#REF!"},{"$error":"#REF!"},{"$error":"#REF!"},{"$error":"#REF!"},{"$error":"#REF!"},{"$error":"#REF!"}]
[116,{"$error":"#REF!"},{"$error":"#REF!"},{"$error":"#REF!"},{"$error":"#REF!"},{"$error":"#REF!"},{"$error":"#REF!"},{"$error":"#REF!"},{"$error":"#REF!"},{"$error":"#REF!"},{"$error":"#REF!"},{"$error":"#REF!"},{"$error":"#REF!"},{"$error":"#REF!"}]
[117,{"$error":"#REF!"},{"$error":"#REF!"},{"$error":"#REF!"},{"$error":"#REF!"},{"$error":"#REF!"},{"$error":"#REF!"},{"$error":"#REF!"},{"$error":"#REF!"},{"$error":"#REF!"},{"$error":"#REF!"},{"$error":"#REF!"},{"$error":"#REF!"},{"$error":"#REF!"}]
[118,{"$error":"#REF!"},{"$error":"#REF!"},{"$error":"#REF!"},{"$error":"#REF!"},{"$error":"#REF!"},{"$error":"#REF!"},{"$error":"#REF!"},{"$error":"#REF!"},{"$f":"+K213+I214","v":{"$error":"#REF!"}},{"$f":"+(1+$C$42)*J214","v":{"$error":"#REF!"}},{"$f":"M213+I214","v":{"$error":"#REF!"}},{"$error":"#REF!"},{"$error":"#REF!"}]
[119,{"$error":"#REF!"},{"$error":"#REF!"},{"$error":"#REF!"},{"$error":"#REF!"},{"$error":"#REF!"},{"$error":"#REF!"},{"$error":"#REF!"},{"$error":"#REF!"},{"$error":"#REF!"},{"$error":"#REF!"},{"$error":"#REF!"},{"$error":"#REF!"},{"$error":"#REF!"}]
[120,{"$error":"#REF!"},{"$error":"#REF!"},{"$error":"#REF!"},{"$error":"#REF!"},{"$error":"#REF!"},{"$error":"#REF!"},{"$error":"#REF!"},{"$error":"#REF!"},{"$error":"#REF!"},{"$error":"#REF!"},{"$error":"#REF!"},{"$error":"#REF!"},{"$error":"#REF!"}]
[121,{"$error":"#REF!"},{"$error":"#REF!"},{"$error":"#REF!"},{"$error":"#REF!"},{"$error":"#REF!"},{"$error":"#REF!"},{"$error":"#REF!"},{"$error":"#REF!"},{"$error":"#REF!"},{"$error":"#REF!"},{"$error":"#REF!"},{"$error":"#REF!"},{"$error":"#REF!"}]
[122,{"$error":"#REF!"},{"$error":"#REF!"},{"$error":"#REF!"},{"$error":"#REF!"},{"$error":"#REF!"},{"$error":"#REF!"},{"$error":"#REF!"},{"$error":"#REF!"},{"$error":"#REF!"},{"$error":"#REF!"},{"$error":"#REF!"},{"$error":"#REF!"},{"$error":"#REF!"}]
[123,{"$error":"#REF!"},{"$error":"#REF!"},{"$error":"#REF!"},{"$error":"#REF!"},{"$error":"#REF!"},{"$error":"#REF!"},{"$error":"#REF!"},{"$error":"#REF!"},{"$error":"#REF!"},{"$error":"#REF!"},{"$error":"#REF!"},{"$error":"#REF!"},{"$error":"#REF!"}]
[124,{"$error":"#REF!"},{"$error":"#REF!"},{"$error":"#REF!"},{"$error":"#REF!"},{"$error":"#REF!"},{"$error":"#REF!"},{"$error":"#REF!"},{"$error":"#REF!"},{"$error":"#REF!"},{"$error":"#REF!"},{"$error":"#REF!"},{"$error":"#REF!"},{"$error":"#REF!"}]
[125,{"$error":"#REF!"},{"$error":"#REF!"},{"$error":"#REF!"},{"$error":"#REF!"},{"$error":"#REF!"},{"$error":"#REF!"},{"$error":"#REF!"},{"$error":"#REF!"},{"$error":"#REF!"},{"$error":"#REF!"},{"$error":"#REF!"},{"$error":"#REF!"},{"$error":"#REF!"}]
[126,{"$error":"#REF!"},{"$error":"#REF!"},{"$error":"#REF!"},{"$error":"#REF!"},{"$error":"#REF!"},{"$error":"#REF!"},{"$error":"#REF!"},{"$error":"#REF!"},{"$error":"#REF!"},{"$error":"#REF!"},{"$error":"#REF!"},{"$error":"#REF!"},{"$error":"#REF!"}]
[127,{"$error":"#REF!"},{"$error":"#REF!"},{"$error":"#REF!"},{"$error":"#REF!"},{"$error":"#REF!"},{"$error":"#REF!"},{"$error":"#REF!"},{"$error":"#REF!"},{"$error":"#REF!"},{"$error":"#REF!"},{"$error":"#REF!"},{"$error":"#REF!"},{"$error":"#REF!"}]
[128,{"$error":"#REF!"},{"$error":"#REF!"},{"$error":"#REF!"},{"$error":"#REF!"},{"$error":"#REF!"},{"$error":"#REF!"},{"$error":"#REF!"},{"$error":"#REF!"},{"$error":"#REF!"},{"$error":"#REF!"},{"$error":"#REF!"},{"$error":"#REF!"},{"$error":"#REF!"}]
[129,{"$error":"#REF!"},{"$error":"#REF!"},{"$f":"$G$49","v":{"$error":"#REF!"}},{"$error":"#REF!"},{"$error":"#REF!"},{"$error":"#REF!"},{"$error":"#REF!"},{"$error":"#REF!"},{"$error":"#REF!"},{"$error":"#REF!"},{"$error":"#REF!"},{"$error":"#REF!"},{"$error":"#REF!"}]
[130,{"$error":"#REF!"},{"$f":"B226","v":{"$error":"#REF!"}},{"$error":"#REF!"},{"$error":"#REF!"},{"$f":"+$C$80+$H$80","v":{"$error":"#REF!"}},{"$f":"+$C$78+$H$78","v":{"$error":"#REF!"}},{"$f":"+$C$76+$C$84","v":{"$error":"#REF!"}},{"$f":"D226-E226-F226-G226-H226","v":{"$error":"#REF!"}},{"$error":"#REF!"},{"$error":"#REF!"},{"$error":"#REF!"},{"$error":"#REF!"},{"$f":"M226-K226","v":{"$error":"#REF!"}}]
[131,{"$f":"DATE(YEAR(B226),MONTH(B226)+1,DAY(B226))","v":{"$error":"#REF!"}},{"$error":"#REF!"},{"$error":"#REF!"},{"$f":"+$C$82+$H$82","v":{"$error":"#REF!"}},{"$error":"#REF!"},{"$error":"#REF!"},{"$error":"#REF!"},{"$error":"#REF!"},{"$error":"#REF!"},{"$error":"#REF!"},{"$f":"M226+I227","v":{"$error":"#REF!"}},{"$f":"L227*(1+$C$44)","v":{"$error":"#REF!"}},{"$error":"#REF!"}]
[132,{"$error":"#REF!"},{"$error":"#REF!"},{"$error":"#REF!"},{"$error":"#REF!"},{"$error":"#REF!"},{"$error":"#REF!"},{"$error":"#REF!"},{"$error":"#REF!"},{"$f":"+K227+I228","v":{"$error":"#REF!"}},{"$error":"#REF!"},{"$error":"#REF!"},{"$error":"#REF!"},{"$error":"#REF!"}]
[133,{"$error":"#REF!"},{"$error":"#REF!"},{"$error":"#REF!"},{"$error":"#REF!"},{"$error":"#REF!"},{"$error":"#REF!"},{"$error":"#REF!"},{"$error":"#REF!"},{"$error":"#REF!"},{"$f":"+(1+$C$42)*J229","v":{"$error":"#REF!"}},{"$error":"#REF!"},{"$error":"#REF!"},{"$error":"#REF!"}]
[134,{"$error":"#REF!"},{"$error":"#REF!"},{"$error":"#REF!"},{"$error":"#REF!"},{"$error":"#REF!"},{"$error":"#REF!"},{"$error":"#REF!"},{"$error":"#REF!"},{"$error":"#REF!"},{"$error":"#REF!"},{"$error":"#REF!"},{"$error":"#REF!"},{"$error":"#REF!"}]
[135,{"$error":"#REF!"},{"$error":"#REF!"},{"$error":"#REF!"},{"$error":"#REF!"},{"$error":"#REF!"},{"$error":"#REF!"},{"$error":"#REF!"},{"$error":"#REF!"},{"$error":"#REF!"},{"$error":"#REF!"},{"$error":"#REF!"},{"$error":"#REF!"},{"$error":"#REF!"}]
[136,{"$error":"#REF!"},{"$error":"#REF!"},{"$error":"#REF!"},{"$error":"#REF!"},{"$error":"#REF!"},{"$error":"#REF!"},{"$error":"#REF!"},{"$error":"#REF!"},{"$error":"#REF!"},{"$error":"#REF!"},{"$error":"#REF!"},{"$error":"#REF!"},{"$error":"#REF!"}]
[137,{"$error":"#REF!"},{"$error":"#REF!"},{"$error":"#REF!"},{"$error":"#REF!"},{"$error":"#REF!"},{"$error":"#REF!"},{"$error":"#REF!"},{"$error":"#REF!"},{"$error":"#REF!"},{"$error":"#REF!"},{"$error":"#REF!"},{"$error":"#REF!"},{"$error":"#REF!"}]
[138,{"$error":"#REF!"},{"$error":"#REF!"},{"$error":"#REF!"},{"$error":"#REF!"},{"$error":"#REF!"},{"$error":"#REF!"},{"$error":"#REF!"},{"$error":"#REF!"},{"$error":"#REF!"},{"$error":"#REF!"},{"$error":"#REF!"},{"$error":"#REF!"},{"$error":"#REF!"}]
[139,{"$error":"#REF!"},{"$error":"#REF!"},{"$error":"#REF!"},{"$error":"#REF!"},{"$error":"#REF!"},{"$error":"#REF!"},{"$error":"#REF!"},{"$error":"#REF!"},{"$error":"#REF!"},{"$error":"#REF!"},{"$error":"#REF!"},{"$error":"#REF!"},{"$error":"#REF!"}]
[140,{"$error":"#REF!"},{"$error":"#REF!"},{"$error":"#REF!"},{"$error":"#REF!"},{"$error":"#REF!"},{"$error":"#REF!"},{"$error":"#REF!"},{"$error":"#REF!"},{"$error":"#REF!"},{"$error":"#REF!"},{"$error":"#REF!"},{"$error":"#REF!"},{"$error":"#REF!"}]
[141,{"$error":"#REF!"},{"$error":"#REF!"},{"$error":"#REF!"},{"$error":"#REF!"},{"$error":"#REF!"},{"$error":"#REF!"},{"$error":"#REF!"},{"$error":"#REF!"},{"$error":"#REF!"},{"$error":"#REF!"},{"$error":"#REF!"},{"$error":"#REF!"},{"$error":"#REF!"}]
[142,{"$error":"#REF!"},{"$error":"#REF!"},{"$error":"#REF!"},{"$error":"#REF!"},{"$error":"#REF!"},{"$error":"#REF!"},{"$error":"#REF!"},{"$error":"#REF!"},{"$error":"#REF!"},{"$error":"#REF!"},{"$error":"#REF!"},{"$error":"#REF!"},{"$error":"#REF!"}]
[143,{"$error":"#REF!"},{"$error":"#REF!"},{"$error":"#REF!"},{"$error":"#REF!"},{"$error":"#REF!"},{"$error":"#REF!"},{"$error":"#REF!"},{"$error":"#REF!"},{"$error":"#REF!"},{"$error":"#REF!"},{"$error":"#REF!"},{"$error":"#REF!"},{"$error":"#REF!"}]
[144,{"$error":"#REF!"},{"$error":"#REF!"},{"$error":"#REF!"},{"$error":"#REF!"},{"$error":"#REF!"},{"$error":"#REF!"},{"$error":"#REF!"},{"$error":"#REF!"},{"$error":"#REF!"},{"$error":"#REF!"},{"$error":"#REF!"},{"$error":"#REF!"},{"$error":"#REF!"}]
[145,{"$error":"#REF!"},{"$error":"#REF!"},{"$error":"#REF!"},{"$error":"#REF!"},{"$error":"#REF!"},{"$error":"#REF!"},{"$error":"#REF!"},{"$error":"#REF!"},{"$error":"#REF!"},{"$error":"#REF!"},{"$error":"#REF!"},{"$error":"#REF!"},{"$error":"#REF!"}]
[146,{"$error":"#REF!"},{"$error":"#REF!"},{"$error":"#REF!"},{"$error":"#REF!"},{"$error":"#REF!"},{"$error":"#REF!"},{"$error":"#REF!"},{"$error":"#REF!"},{"$error":"#REF!"},{"$error":"#REF!"},{"$error":"#REF!"},{"$error":"#REF!"},{"$error":"#REF!"}]
[147,{"$error":"#REF!"},{"$error":"#REF!"},{"$error":"#REF!"},{"$error":"#REF!"},{"$error":"#REF!"},{"$error":"#REF!"},{"$error":"#REF!"},{"$error":"#REF!"},{"$error":"#REF!"},{"$error":"#REF!"},{"$error":"#REF!"},{"$error":"#REF!"},{"$error":"#REF!"}]
[148,{"$error":"#REF!"},{"$error":"#REF!"},{"$error":"#REF!"},{"$error":"#REF!"},{"$error":"#REF!"},{"$error":"#REF!"},{"$error":"#REF!"},{"$error":"#REF!"},{"$error":"#REF!"},{"$error":"#REF!"},{"$error":"#REF!"},{"$error":"#REF!"},{"$error":"#REF!"}]
[149,{"$error":"#REF!"},{"$error":"#REF!"},{"$error":"#REF!"},{"$error":"#REF!"},{"$error":"#REF!"},{"$error":"#REF!"},{"$error":"#REF!"},{"$error":"#REF!"},{"$error":"#REF!"},{"$error":"#REF!"},{"$error":"#REF!"},{"$error":"#REF!"},{"$error":"#REF!"}]
[150,{"$error":"#REF!"},{"$error":"#REF!"},{"$error":"#REF!"},{"$error":"#REF!"},{"$error":"#REF!"},{"$error":"#REF!"},{"$error":"#REF!"},{"$error":"#REF!"},{"$error":"#REF!"},{"$error":"#REF!"},{"$error":"#REF!"},{"$error":"#REF!"},{"$error":"#REF!"}]
[151,{"$error":"#REF!"},{"$error":"#REF!"},{"$error":"#REF!"},{"$error":"#REF!"},{"$error":"#REF!"},{"$error":"#REF!"},{"$error":"#REF!"},{"$error":"#REF!"},{"$error":"#REF!"},{"$error":"#REF!"},{"$error":"#REF!"},{"$error":"#REF!"},{"$error":"#REF!"}]
[152,{"$error":"#REF!"},{"$error":"#REF!"},{"$error":"#REF!"},{"$error":"#REF!"},{"$error":"#REF!"},{"$error":"#REF!"},{"$error":"#REF!"},{"$error":"#REF!"},{"$error":"#REF!"},{"$error":"#REF!"},{"$error":"#REF!"},{"$error":"#REF!"},{"$error":"#REF!"}]
[153,{"$error":"#REF!"},{"$error":"#REF!"},{"$error":"#REF!"},{"$error":"#REF!"},{"$error":"#REF!"},{"$error":"#REF!"},{"$error":"#REF!"},{"$error":"#REF!"},{"$error":"#REF!"},{"$error":"#REF!"},{"$error":"#REF!"},{"$error":"#REF!"},{"$error":"#REF!"}]
[154,{"$error":"#REF!"},{"$error":"#REF!"},{"$error":"#REF!"},{"$error":"#REF!"},{"$error":"#REF!"},{"$error":"#REF!"},{"$error":"#REF!"},{"$error":"#REF!"},{"$error":"#REF!"},{"$error":"#REF!"},{"$error":"#REF!"},{"$error":"#REF!"},{"$error":"#REF!"}]
[155,{"$error":"#REF!"},{"$error":"#REF!"},{"$error":"#REF!"},{"$error":"#REF!"},{"$error":"#REF!"},{"$error":"#REF!"},{"$error":"#REF!"},{"$error":"#REF!"},{"$error":"#REF!"},{"$error":"#REF!"},{"$error":"#REF!"},{"$error":"#REF!"},{"$error":"#REF!"}]
[156,{"$error":"#REF!"},{"$error":"#REF!"},{"$error":"#REF!"},{"$error":"#REF!"},{"$error":"#REF!"},{"$error":"#REF!"},{"$error":"#REF!"},{"$error":"#REF!"},{"$error":"#REF!"},{"$error":"#REF!"},{"$error":"#REF!"},{"$error":"#REF!"},{"$error":"#REF!"}]
[157,{"$error":"#REF!"},{"$error":"#REF!"},{"$error":"#REF!"},{"$error":"#REF!"},{"$error":"#REF!"},{"$error":"#REF!"},{"$error":"#REF!"},{"$error":"#REF!"},{"$error":"#REF!"},{"$error":"#REF!"},{"$error":"#REF!"},{"$error":"#REF!"},{"$error":"#REF!"}]
[158,{"$error":"#REF!"},{"$error":"#REF!"},{"$error":"#REF!"},{"$error":"#REF!"},{"$error":"#REF!"},{"$error":"#REF!"},{"$error":"#REF!"},{"$error":"#REF!"},{"$error":"#REF!"},{"$error":"#REF!"},{"$error":"#REF!"},{"$error":"#REF!"},{"$error":"#REF!"}]
[159,{"$error":"#REF!"},{"$error":"#REF!"},{"$error":"#REF!"},{"$error":"#REF!"},{"$error":"#REF!"},{"$error":"#REF!"},{"$error":"#REF!"},{"$error":"#REF!"},{"$error":"#REF!"},{"$error":"#REF!"},{"$error":"#REF!"},{"$error":"#REF!"},{"$error":"#REF!"}]
[160,{"$error":"#REF!"},{"$error":"#REF!"},{"$error":"#REF!"},{"$error":"#REF!"},{"$error":"#REF!"},{"$error":"#REF!"},{"$error":"#REF!"},{"$error":"#REF!"},{"$error":"#REF!"},{"$error":"#REF!"},{"$error":"#REF!"},{"$error":"#REF!"},{"$error":"#REF!"}]
[161,{"$error":"#REF!"},{"$error":"#REF!"},{"$error":"#REF!"},{"$error":"#REF!"},{"$error":"#REF!"},{"$error":"#REF!"},{"$error":"#REF!"},{"$error":"#REF!"},{"$error":"#REF!"},{"$error":"#REF!"},{"$error":"#REF!"},{"$error":"#REF!"},{"$error":"#REF!"}]
[162,{"$error":"#REF!"},{"$error":"#REF!"},{"$error":"#REF!"},{"$error":"#REF!"},{"$error":"#REF!"},{"$error":"#REF!"},{"$error":"#REF!"},{"$error":"#REF!"},{"$error":"#REF!"},{"$error":"#REF!"},{"$error":"#REF!"},{"$error":"#REF!"},{"$error":"#REF!"}]
[163,{"$error":"#REF!"},{"$error":"#REF!"},{"$error":"#REF!"},{"$error":"#REF!"},{"$error":"#REF!"},{"$error":"#REF!"},{"$error":"#REF!"},{"$error":"#REF!"},{"$error":"#REF!"},{"$error":"#REF!"},{"$error":"#REF!"},{"$error":"#REF!"},{"$error":"#REF!"}]
[164,{"$error":"#REF!"},{"$error":"#REF!"},{"$error":"#REF!"},{"$error":"#REF!"},{"$error":"#REF!"},{"$error":"#REF!"},{"$error":"#REF!"},{"$error":"#REF!"},{"$error":"#REF!"},{"$error":"#REF!"},{"$error":"#REF!"},{"$error":"#REF!"},{"$error":"#REF!"}]
[165,{"$error":"#REF!"},{"$error":"#REF!"},{"$error":"#REF!"},{"$error":"#REF!"},{"$error":"#REF!"},{"$error":"#REF!"},{"$error":"#REF!"},{"$error":"#REF!"},{"$error":"#REF!"},{"$error":"#REF!"},{"$error":"#REF!"},{"$error":"#REF!"},{"$error":"#REF!"}]
[166,{"$error":"#REF!"},{"$error":"#REF!"},{"$error":"#REF!"},{"$error":"#REF!"},{"$error":"#REF!"},{"$error":"#REF!"},{"$error":"#REF!"},{"$error":"#REF!"},{"$error":"#REF!"},{"$error":"#REF!"},{"$error":"#REF!"},{"$error":"#REF!"},{"$error":"#REF!"}]
[167,{"$error":"#REF!"},{"$error":"#REF!"},{"$error":"#REF!"},{"$error":"#REF!"},{"$error":"#REF!"},{"$error":"#REF!"},{"$error":"#REF!"},{"$error":"#REF!"},{"$error":"#REF!"},{"$error":"#REF!"},{"$error":"#REF!"},{"$error":"#REF!"},{"$error":"#REF!"}]
[168,{"$error":"#REF!"},{"$error":"#REF!"},{"$error":"#REF!"},{"$error":"#REF!"},{"$error":"#REF!"},{"$error":"#REF!"},{"$error":"#REF!"},{"$error":"#REF!"},{"$error":"#REF!"},{"$error":"#REF!"},{"$error":"#REF!"},{"$error":"#REF!"},{"$error":"#REF!"}]
[169,{"$error":"#REF!"},{"$error":"#REF!"},{"$error":"#REF!"},{"$error":"#REF!"},{"$error":"#REF!"},{"$error":"#REF!"},{"$error":"#REF!"},{"$error":"#REF!"},{"$error":"#REF!"},{"$error":"#REF!"},{"$error":"#REF!"},{"$error":"#REF!"},{"$error":"#REF!"}]
[170,{"$error":"#REF!"},{"$error":"#REF!"},{"$error":"#REF!"},{"$error":"#REF!"},{"$error":"#REF!"},{"$error":"#REF!"},{"$error":"#REF!"},{"$error":"#REF!"},{"$error":"#REF!"},{"$error":"#REF!"},{"$error":"#REF!"},{"$error":"#REF!"},{"$error":"#REF!"}]
[171,{"$error":"#REF!"},{"$error":"#REF!"},{"$error":"#REF!"},{"$error":"#REF!"},{"$error":"#REF!"},{"$error":"#REF!"},{"$error":"#REF!"},{"$error":"#REF!"},{"$error":"#REF!"},{"$error":"#REF!"},{"$error":"#REF!"},{"$error":"#REF!"},{"$error":"#REF!"}]
[172,{"$error":"#REF!"},{"$error":"#REF!"},{"$error":"#REF!"},{"$error":"#REF!"},{"$error":"#REF!"},{"$error":"#REF!"},{"$error":"#REF!"},{"$error":"#REF!"},{"$error":"#REF!"},{"$error":"#REF!"},{"$error":"#REF!"},{"$error":"#REF!"},{"$error":"#REF!"}]
[173,{"$error":"#REF!"},{"$error":"#REF!"},{"$error":"#REF!"},{"$error":"#REF!"},{"$error":"#REF!"},{"$error":"#REF!"},{"$error":"#REF!"},{"$error":"#REF!"},{"$error":"#REF!"},{"$error":"#REF!"},{"$error":"#REF!"},{"$error":"#REF!"},{"$error":"#REF!"}]
[174,{"$error":"#REF!"},{"$error":"#REF!"},{"$error":"#REF!"},{"$error":"#REF!"},{"$error":"#REF!"},{"$error":"#REF!"},{"$error":"#REF!"},{"$error":"#REF!"},{"$error":"#REF!"},{"$error":"#REF!"},{"$error":"#REF!"},{"$error":"#REF!"},{"$error":"#REF!"}]
[175,{"$error":"#REF!"},{"$error":"#REF!"},{"$error":"#REF!"},{"$error":"#REF!"},{"$error":"#REF!"},{"$error":"#REF!"},{"$error":"#REF!"},{"$error":"#REF!"},{"$error":"#REF!"},{"$error":"#REF!"},{"$error":"#REF!"},{"$error":"#REF!"},{"$error":"#REF!"}]
[176,{"$error":"#REF!"},{"$error":"#REF!"},{"$error":"#REF!"},{"$error":"#REF!"},{"$error":"#REF!"},{"$error":"#REF!"},{"$error":"#REF!"},{"$error":"#REF!"},{"$error":"#REF!"},{"$error":"#REF!"},{"$error":"#REF!"},{"$error":"#REF!"},{"$error":"#REF!"}]
[177,{"$error":"#REF!"},{"$error":"#REF!"},{"$error":"#REF!"},{"$error":"#REF!"},{"$error":"#REF!"},{"$error":"#REF!"},{"$error":"#REF!"},{"$error":"#REF!"},{"$error":"#REF!"},{"$error":"#REF!"},{"$error":"#REF!"},{"$error":"#REF!"},{"$error":"#REF!"}]
[178,{"$error":"#REF!"},{"$error":"#REF!"},{"$error":"#REF!"},{"$error":"#REF!"},{"$error":"#REF!"},{"$error":"#REF!"},{"$error":"#REF!"},{"$error":"#REF!"},{"$error":"#REF!"},{"$error":"#REF!"},{"$error":"#REF!"},{"$error":"#REF!"},{"$error":"#REF!"}]
[179,{"$error":"#REF!"},{"$error":"#REF!"},{"$error":"#REF!"},{"$error":"#REF!"},{"$error":"#REF!"},{"$error":"#REF!"},{"$error":"#REF!"},{"$error":"#REF!"},{"$error":"#REF!"},{"$error":"#REF!"},{"$error":"#REF!"},{"$error":"#REF!"},{"$error":"#REF!"}]
[180,{"$error":"#REF!"},{"$error":"#REF!"},{"$error":"#REF!"},{"$error":"#REF!"},{"$error":"#REF!"},{"$error":"#REF!"},{"$error":"#REF!"},{"$error":"#REF!"},{"$error":"#REF!"},{"$error":"#REF!"},{"$error":"#REF!"},{"$error":"#REF!"},{"$error":"#REF!"}]
[181,{"$error":"#REF!"},{"$error":"#REF!"},{"$error":"#REF!"},{"$error":"#REF!"},{"$error":"#REF!"},{"$error":"#REF!"},{"$error":"#REF!"},{"$error":"#REF!"},{"$error":"#REF!"},{"$error":"#REF!"},{"$error":"#REF!"},{"$error":"#REF!"},{"$error":"#REF!"}]
[182,{"$error":"#REF!"},{"$error":"#REF!"},{"$error":"#REF!"},{"$error":"#REF!"},{"$error":"#REF!"},{"$error":"#REF!"},{"$error":"#REF!"},{"$error":"#REF!"},{"$error":"#REF!"},{"$error":"#REF!"},{"$error":"#REF!"},{"$error":"#REF!"},{"$error":"#REF!"}]
[183,{"$error":"#REF!"},{"$error":"#REF!"},{"$error":"#REF!"},{"$error":"#REF!"},{"$error":"#REF!"},{"$error":"#REF!"},{"$error":"#REF!"},{"$error":"#REF!"},{"$error":"#REF!"},{"$error":"#REF!"},{"$error":"#REF!"},{"$error":"#REF!"},{"$error":"#REF!"}]
[184,{"$error":"#REF!"},{"$error":"#REF!"},{"$error":"#REF!"},{"$error":"#REF!"},{"$error":"#REF!"},{"$error":"#REF!"},{"$error":"#REF!"},{"$error":"#REF!"},{"$error":"#REF!"},{"$error":"#REF!"},{"$error":"#REF!"},{"$error":"#REF!"},{"$error":"#REF!"}]
[185,{"$error":"#REF!"},{"$error":"#REF!"},{"$error":"#REF!"},{"$error":"#REF!"},{"$error":"#REF!"},{"$error":"#REF!"},{"$error":"#REF!"},{"$error":"#REF!"},{"$error":"#REF!"},{"$error":"#REF!"},{"$error":"#REF!"},{"$error":"#REF!"},{"$error":"#REF!"}]
[186,{"$error":"#REF!"},{"$error":"#REF!"},{"$error":"#REF!"},{"$error":"#REF!"},{"$error":"#REF!"},{"$error":"#REF!"},{"$error":"#REF!"},{"$error":"#REF!"},{"$error":"#REF!"},{"$error":"#REF!"},{"$error":"#REF!"},{"$error":"#REF!"},{"$error":"#REF!"}]
[187,{"$error":"#REF!"},{"$error":"#REF!"},{"$error":"#REF!"},{"$error":"#REF!"},{"$error":"#REF!"},{"$error":"#REF!"},{"$error":"#REF!"},{"$error":"#REF!"},{"$error":"#REF!"},{"$error":"#REF!"},{"$error":"#REF!"},{"$error":"#REF!"},{"$error":"#REF!"}]
[188,{"$error":"#REF!"},{"$error":"#REF!"},{"$error":"#REF!"},{"$error":"#REF!"},{"$error":"#REF!"},{"$error":"#REF!"},{"$error":"#REF!"},{"$error":"#REF!"},{"$error":"#REF!"},{"$error":"#REF!"},{"$error":"#REF!"},{"$error":"#REF!"},{"$error":"#REF!"}]
[189,{"$error":"#REF!"},{"$error":"#REF!"},{"$error":"#REF!"},{"$error":"#REF!"},{"$error":"#REF!"},{"$error":"#REF!"},{"$error":"#REF!"},{"$error":"#REF!"},{"$error":"#REF!"},{"$error":"#REF!"},{"$error":"#REF!"},{"$error":"#REF!"},{"$error":"#REF!"}]
[190,{"$error":"#REF!"},{"$error":"#REF!"},{"$error":"#REF!"},{"$error":"#REF!"},{"$error":"#REF!"},{"$error":"#REF!"},{"$error":"#REF!"},{"$error":"#REF!"},{"$error":"#REF!"},{"$error":"#REF!"},{"$error":"#REF!"},{"$error":"#REF!"},{"$error":"#REF!"}]
[191,{"$error":"#REF!"},{"$error":"#REF!"},{"$error":"#REF!"},{"$error":"#REF!"},{"$error":"#REF!"},{"$error":"#REF!"},{"$error":"#REF!"},{"$error":"#REF!"},{"$error":"#REF!"},{"$error":"#REF!"},{"$error":"#REF!"},{"$error":"#REF!"},{"$error":"#REF!"}]
[192,{"$error":"#REF!"},{"$error":"#REF!"},{"$error":"#REF!"},{"$error":"#REF!"},{"$error":"#REF!"},{"$error":"#REF!"},{"$error":"#REF!"},{"$error":"#REF!"},{"$error":"#REF!"},{"$error":"#REF!"},{"$error":"#REF!"},{"$error":"#REF!"},{"$error":"#REF!"}]
[193,{"$error":"#REF!"},{"$error":"#REF!"},{"$f":"$G$49","v":{"$error":"#REF!"}},{"$error":"#REF!"},{"$error":"#REF!"},{"$error":"#REF!"},{"$error":"#REF!"},{"$error":"#REF!"},{"$error":"#REF!"},{"$error":"#REF!"},{"$error":"#REF!"},{"$error":"#REF!"},{"$error":"#REF!"}]
[194,{"$error":"#REF!"},{"$f":"B290","v":{"$error":"#REF!"}},{"$error":"#REF!"},{"$error":"#REF!"},{"$f":"+$C$80+$H$80","v":{"$error":"#REF!"}},{"$f":"+$C$78+$H$78","v":{"$error":"#REF!"}},{"$f":"+$C$76+$C$84","v":{"$error":"#REF!"}},{"$f":"D290-E290-F290-G290-H290","v":{"$error":"#REF!"}},{"$error":"#REF!"},{"$error":"#REF!"},{"$error":"#REF!"},{"$error":"#REF!"},{"$f":"M290-K290","v":{"$error":"#REF!"}}]
[195,{"$f":"DATE(YEAR(B290),MONTH(B290)+1,DAY(B290))","v":{"$error":"#REF!"}},{"$error":"#REF!"},{"$error":"#REF!"},{"$f":"+$C$82+$H$82","v":{"$error":"#REF!"}},{"$error":"#REF!"},{"$error":"#REF!"},{"$error":"#REF!"},{"$error":"#REF!"},{"$error":"#REF!"},{"$error":"#REF!"},{"$f":"M290+I291","v":{"$error":"#REF!"}},{"$f":"L291*(1+$C$44)","v":{"$error":"#REF!"}},{"$error":"#REF!"}]
[196,{"$error":"#REF!"},{"$error":"#REF!"},{"$error":"#REF!"},{"$error":"#REF!"},{"$error":"#REF!"},{"$error":"#REF!"},{"$error":"#REF!"},{"$error":"#REF!"},{"$f":"+K291+I292","v":{"$error":"#REF!"}},{"$error":"#REF!"},{"$error":"#REF!"},{"$error":"#REF!"},{"$error":"#REF!"}]
[197,{"$error":"#REF!"},{"$error":"#REF!"},{"$error":"#REF!"},{"$error":"#REF!"},{"$error":"#REF!"},{"$error":"#REF!"},{"$error":"#REF!"},{"$error":"#REF!"},{"$error":"#REF!"},{"$f":"+(1+$C$42)*J293","v":{"$error":"#REF!"}},{"$error":"#REF!"},{"$error":"#REF!"},{"$error":"#REF!"}]
[198,{"$error":"#REF!"},{"$error":"#REF!"},{"$error":"#REF!"},{"$error":"#REF!"},{"$error":"#REF!"},{"$error":"#REF!"},{"$error":"#REF!"},{"$error":"#REF!"},{"$error":"#REF!"},{"$error":"#REF!"},{"$error":"#REF!"},{"$error":"#REF!"},{"$error":"#REF!"}]
[199,{"$error":"#REF!"},{"$error":"#REF!"},{"$error":"#REF!"},{"$error":"#REF!"},{"$error":"#REF!"},{"$error":"#REF!"},{"$error":"#REF!"},{"$error":"#REF!"},{"$error":"#REF!"},{"$error":"#REF!"},{"$error":"#REF!"},{"$error":"#REF!"},{"$error":"#REF!"}]
[200,{"$error":"#REF!"},{"$error":"#REF!"},{"$error":"#REF!"},{"$error":"#REF!"},{"$error":"#REF!"},{"$error":"#REF!"},{"$error":"#REF!"},{"$error":"#REF!"},{"$error":"#REF!"},{"$error":"#REF!"},{"$error":"#REF!"},{"$error":"#REF!"},{"$error":"#REF!"}]
[201,{"$error":"#REF!"},{"$error":"#REF!"},{"$error":"#REF!"},{"$error":"#REF!"},{"$error":"#REF!"},{"$error":"#REF!"},{"$error":"#REF!"},{"$error":"#REF!"},{"$error":"#REF!"},{"$error":"#REF!"},{"$error":"#REF!"},{"$error":"#REF!"},{"$error":"#REF!"}]
[202,{"$error":"#REF!"},{"$error":"#REF!"},{"$error":"#REF!"},{"$error":"#REF!"},{"$error":"#REF!"},{"$error":"#REF!"},{"$error":"#REF!"},{"$error":"#REF!"},{"$error":"#REF!"},{"$error":"#REF!"},{"$error":"#REF!"},{"$error":"#REF!"},{"$error":"#REF!"}]
[203,{"$error":"#REF!"},{"$error":"#REF!"},{"$error":"#REF!"},{"$error":"#REF!"},{"$error":"#REF!"},{"$error":"#REF!"},{"$error":"#REF!"},{"$error":"#REF!"},{"$error":"#REF!"},{"$error":"#REF!"},{"$error":"#REF!"},{"$error":"#REF!"},{"$error":"#REF!"}]
[204,{"$error":"#REF!"},{"$error":"#REF!"},{"$error":"#REF!"},{"$error":"#REF!"},{"$error":"#REF!"},{"$error":"#REF!"},{"$error":"#REF!"},{"$error":"#REF!"},{"$error":"#REF!"},{"$error":"#REF!"},{"$error":"#REF!"},{"$error":"#REF!"},{"$error":"#REF!"}]
[205,{"$error":"#REF!"},{"$error":"#REF!"},{"$error":"#REF!"},{"$error":"#REF!"},{"$error":"#REF!"},{"$error":"#REF!"},{"$error":"#REF!"},{"$error":"#REF!"},{"$error":"#REF!"},{"$error":"#REF!"},{"$error":"#REF!"},{"$error":"#REF!"},{"$error":"#REF!"}]
[206,{"$error":"#REF!"},{"$error":"#REF!"},{"$error":"#REF!"},{"$error":"#REF!"},{"$error":"#REF!"},{"$error":"#REF!"},{"$error":"#REF!"},{"$error":"#REF!"},{"$error":"#REF!"},{"$error":"#REF!"},{"$error":"#REF!"},{"$error":"#REF!"},{"$error":"#REF!"}]
[207,{"$error":"#REF!"},{"$error":"#REF!"},{"$error":"#REF!"},{"$error":"#REF!"},{"$error":"#REF!"},{"$error":"#REF!"},{"$error":"#REF!"},{"$error":"#REF!"},{"$error":"#REF!"},{"$error":"#REF!"},{"$error":"#REF!"},{"$error":"#REF!"},{"$error":"#REF!"}]
[208,{"$error":"#REF!"},{"$error":"#REF!"},{"$error":"#REF!"},{"$error":"#REF!"},{"$error":"#REF!"},{"$error":"#REF!"},{"$error":"#REF!"},{"$error":"#REF!"},{"$error":"#REF!"},{"$error":"#REF!"},{"$error":"#REF!"},{"$error":"#REF!"},{"$error":"#REF!"}]
[209,{"$error":"#REF!"},{"$error":"#REF!"},{"$error":"#REF!"},{"$error":"#REF!"},{"$error":"#REF!"},{"$error":"#REF!"},{"$error":"#REF!"},{"$error":"#REF!"},{"$error":"#REF!"},{"$error":"#REF!"},{"$error":"#REF!"},{"$error":"#REF!"},{"$error":"#REF!"}]
[210,{"$error":"#REF!"},{"$error":"#REF!"},{"$error":"#REF!"},{"$error":"#REF!"},{"$error":"#REF!"},{"$error":"#REF!"},{"$error":"#REF!"},{"$error":"#REF!"},{"$error":"#REF!"},{"$error":"#REF!"},{"$error":"#REF!"},{"$error":"#REF!"},{"$error":"#REF!"}]
[211,{"$error":"#REF!"},{"$error":"#REF!"},{"$error":"#REF!"},{"$error":"#REF!"},{"$error":"#REF!"},{"$error":"#REF!"},{"$error":"#REF!"},{"$error":"#REF!"},{"$error":"#REF!"},{"$error":"#REF!"},{"$error":"#REF!"},{"$error":"#REF!"},{"$error":"#REF!"}]
[212,{"$error":"#REF!"},{"$error":"#REF!"},{"$error":"#REF!"},{"$error":"#REF!"},{"$error":"#REF!"},{"$error":"#REF!"},{"$error":"#REF!"},{"$error":"#REF!"},{"$error":"#REF!"},{"$error":"#REF!"},{"$error":"#REF!"},{"$error":"#REF!"},{"$error":"#REF!"}]
[213,{"$error":"#REF!"},{"$error":"#REF!"},{"$error":"#REF!"},{"$error":"#REF!"},{"$error":"#REF!"},{"$error":"#REF!"},{"$error":"#REF!"},{"$error":"#REF!"},{"$error":"#REF!"},{"$error":"#REF!"},{"$error":"#REF!"},{"$error":"#REF!"},{"$error":"#REF!"}]
[214,{"$error":"#REF!"},{"$error":"#REF!"},{"$error":"#REF!"},{"$error":"#REF!"},{"$error":"#REF!"},{"$error":"#REF!"},{"$error":"#REF!"},{"$error":"#REF!"},{"$error":"#REF!"},{"$error":"#REF!"},{"$error":"#REF!"},{"$error":"#REF!"},{"$error":"#REF!"}]
[215,{"$error":"#REF!"},{"$error":"#REF!"},{"$error":"#REF!"},{"$error":"#REF!"},{"$error":"#REF!"},{"$error":"#REF!"},{"$error":"#REF!"},{"$error":"#REF!"},{"$error":"#REF!"},{"$error":"#REF!"},{"$error":"#REF!"},{"$error":"#REF!"},{"$error":"#REF!"}]
[216,{"$error":"#REF!"},{"$error":"#REF!"},{"$error":"#REF!"},{"$error":"#REF!"},{"$error":"#REF!"},{"$error":"#REF!"},{"$error":"#REF!"},{"$error":"#REF!"},{"$error":"#REF!"},{"$error":"#REF!"},{"$error":"#REF!"},{"$error":"#REF!"},{"$error":"#REF!"}]
[217,{"$error":"#REF!"},{"$error":"#REF!"},{"$error":"#REF!"},{"$error":"#REF!"},{"$error":"#REF!"},{"$error":"#REF!"},{"$error":"#REF!"},{"$error":"#REF!"},{"$error":"#REF!"},{"$error":"#REF!"},{"$error":"#REF!"},{"$error":"#REF!"},{"$error":"#REF!"}]
[218,{"$error":"#REF!"},{"$error":"#REF!"},{"$error":"#REF!"},{"$error":"#REF!"},{"$error":"#REF!"},{"$error":"#REF!"},{"$error":"#REF!"},{"$error":"#REF!"},{"$error":"#REF!"},{"$error":"#REF!"},{"$error":"#REF!"},{"$error":"#REF!"},{"$error":"#REF!"}]
[219,{"$error":"#REF!"},{"$error":"#REF!"},{"$error":"#REF!"},{"$error":"#REF!"},{"$error":"#REF!"},{"$error":"#REF!"},{"$error":"#REF!"},{"$error":"#REF!"},{"$error":"#REF!"},{"$error":"#REF!"},{"$error":"#REF!"},{"$error":"#REF!"},{"$error":"#REF!"}]
[220,{"$error":"#REF!"},{"$error":"#REF!"},{"$error":"#REF!"},{"$error":"#REF!"},{"$error":"#REF!"},{"$error":"#REF!"},{"$error":"#REF!"},{"$error":"#REF!"},{"$error":"#REF!"},{"$error":"#REF!"},{"$error":"#REF!"},{"$error":"#REF!"},{"$error":"#REF!"}]
[221,{"$error":"#REF!"},{"$error":"#REF!"},{"$error":"#REF!"},{"$error":"#REF!"},{"$error":"#REF!"},{"$error":"#REF!"},{"$error":"#REF!"},{"$error":"#REF!"},{"$error":"#REF!"},{"$error":"#REF!"},{"$error":"#REF!"},{"$error":"#REF!"},{"$error":"#REF!"}]
[222,{"$error":"#REF!"},{"$error":"#REF!"},{"$error":"#REF!"},{"$error":"#REF!"},{"$error":"#REF!"},{"$error":"#REF!"},{"$error":"#REF!"},{"$error":"#REF!"},{"$error":"#REF!"},{"$error":"#REF!"},{"$error":"#REF!"},{"$error":"#REF!"},{"$error":"#REF!"}]
[223,{"$error":"#REF!"},{"$error":"#REF!"},{"$error":"#REF!"},{"$error":"#REF!"},{"$error":"#REF!"},{"$error":"#REF!"},{"$error":"#REF!"},{"$error":"#REF!"},{"$error":"#REF!"},{"$error":"#REF!"},{"$error":"#REF!"},{"$error":"#REF!"},{"$error":"#REF!"}]
[224,{"$error":"#REF!"},{"$error":"#REF!"},{"$error":"#REF!"},{"$error":"#REF!"},{"$error":"#REF!"},{"$error":"#REF!"},{"$error":"#REF!"},{"$error":"#REF!"},{"$error":"#REF!"},{"$error":"#REF!"},{"$error":"#REF!"},{"$error":"#REF!"},{"$error":"#REF!"}]
[225,{"$error":"#REF!"},{"$error":"#REF!"},{"$error":"#REF!"},{"$error":"#REF!"},{"$error":"#REF!"},{"$error":"#REF!"},{"$error":"#REF!"},{"$error":"#REF!"},{"$error":"#REF!"},{"$error":"#REF!"},{"$error":"#REF!"},{"$error":"#REF!"},{"$error":"#REF!"}]
[226,{"$error":"#REF!"},{"$error":"#REF!"},{"$error":"#REF!"},{"$error":"#REF!"},{"$error":"#REF!"},{"$error":"#REF!"},{"$error":"#REF!"},{"$error":"#REF!"},{"$error":"#REF!"},{"$error":"#REF!"},{"$error":"#REF!"},{"$error":"#REF!"},{"$error":"#REF!"}]
[227,{"$error":"#REF!"},{"$error":"#REF!"},{"$error":"#REF!"},{"$error":"#REF!"},{"$error":"#REF!"},{"$error":"#REF!"},{"$error":"#REF!"},{"$error":"#REF!"},{"$error":"#REF!"},{"$error":"#REF!"},{"$error":"#REF!"},{"$error":"#REF!"},{"$error":"#REF!"}]
[228,{"$error":"#REF!"},{"$error":"#REF!"},{"$error":"#REF!"},{"$error":"#REF!"},{"$error":"#REF!"},{"$error":"#REF!"},{"$error":"#REF!"},{"$error":"#REF!"},{"$error":"#REF!"},{"$error":"#REF!"},{"$error":"#REF!"},{"$error":"#REF!"},{"$error":"#REF!"}]
[229,{"$error":"#REF!"},{"$error":"#REF!"},{"$error":"#REF!"},{"$error":"#REF!"},{"$error":"#REF!"},{"$error":"#REF!"},{"$error":"#REF!"},{"$error":"#REF!"},{"$error":"#REF!"},{"$error":"#REF!"},{"$error":"#REF!"},{"$error":"#REF!"},{"$error":"#REF!"}]
[230,{"$error":"#REF!"},{"$error":"#REF!"},{"$error":"#REF!"},{"$error":"#REF!"},{"$error":"#REF!"},{"$error":"#REF!"},{"$error":"#REF!"},{"$error":"#REF!"},{"$error":"#REF!"},{"$error":"#REF!"},{"$error":"#REF!"},{"$error":"#REF!"},{"$error":"#REF!"}]
[231,{"$error":"#REF!"},{"$error":"#REF!"},{"$error":"#REF!"},{"$error":"#REF!"},{"$error":"#REF!"},{"$error":"#REF!"},{"$error":"#REF!"},{"$error":"#REF!"},{"$error":"#REF!"},{"$error":"#REF!"},{"$error":"#REF!"},{"$error":"#REF!"},{"$error":"#REF!"}]
[232,{"$error":"#REF!"},{"$error":"#REF!"},{"$error":"#REF!"},{"$error":"#REF!"},{"$error":"#REF!"},{"$error":"#REF!"},{"$error":"#REF!"},{"$error":"#REF!"},{"$error":"#REF!"},{"$error":"#REF!"},{"$error":"#REF!"},{"$error":"#REF!"},{"$error":"#REF!"}]
[233,{"$error":"#REF!"},{"$error":"#REF!"},{"$error":"#REF!"},{"$error":"#REF!"},{"$error":"#REF!"},{"$error":"#REF!"},{"$error":"#REF!"},{"$error":"#REF!"},{"$error":"#REF!"},{"$error":"#REF!"},{"$error":"#REF!"},{"$error":"#REF!"},{"$error":"#REF!"}]
[234,{"$error":"#REF!"},{"$error":"#REF!"},{"$error":"#REF!"},{"$error":"#REF!"},{"$error":"#REF!"},{"$error":"#REF!"},{"$error":"#REF!"},{"$error":"#REF!"},{"$error":"#REF!"},{"$error":"#REF!"},{"$error":"#REF!"},{"$error":"#REF!"},{"$error":"#REF!"}]
[235,{"$error":"#REF!"},{"$error":"#REF!"},{"$error":"#REF!"},{"$error":"#REF!"},{"$error":"#REF!"},{"$error":"#REF!"},{"$error":"#REF!"},{"$error":"#REF!"},{"$error":"#REF!"},{"$error":"#REF!"},{"$error":"#REF!"},{"$error":"#REF!"},{"$error":"#REF!"}]
[236,{"$error":"#REF!"},{"$error":"#REF!"},{"$error":"#REF!"},{"$error":"#REF!"},{"$error":"#REF!"},{"$error":"#REF!"},{"$error":"#REF!"},{"$error":"#REF!"},{"$error":"#REF!"},{"$error":"#REF!"},{"$error":"#REF!"},{"$error":"#REF!"},{"$error":"#REF!"}]
[237,{"$error":"#REF!"},{"$error":"#REF!"},{"$error":"#REF!"},{"$error":"#REF!"},{"$error":"#REF!"},{"$error":"#REF!"},{"$error":"#REF!"},{"$error":"#REF!"},{"$error":"#REF!"},{"$error":"#REF!"},{"$error":"#REF!"},{"$error":"#REF!"},{"$error":"#REF!"}]
[238,{"$error":"#REF!"},{"$error":"#REF!"},{"$error":"#REF!"},{"$error":"#REF!"},{"$error":"#REF!"},{"$error":"#REF!"},{"$error":"#REF!"},{"$error":"#REF!"},{"$error":"#REF!"},{"$error":"#REF!"},{"$error":"#REF!"},{"$error":"#REF!"},{"$error":"#REF!"}]
[239,{"$error":"#REF!"},{"$error":"#REF!"},{"$error":"#REF!"},{"$error":"#REF!"},{"$error":"#REF!"},{"$error":"#REF!"},{"$error":"#REF!"},{"$error":"#REF!"},{"$error":"#REF!"},{"$error":"#REF!"},{"$error":"#REF!"},{"$error":"#REF!"},{"$error":"#REF!"}]
[240,{"$error":"#REF!"},{"$error":"#REF!"},{"$error":"#REF!"},{"$error":"#REF!"},{"$error":"#REF!"},{"$error":"#REF!"},{"$error":"#REF!"},{"$error":"#REF!"},{"$error":"#REF!"},{"$error":"#REF!"},{"$error":"#REF!"},{"$error":"#REF!"},{"$error":"#REF!"}]
[241,{"$error":"#REF!"},{"$error":"#REF!"},{"$error":"#REF!"},{"$error":"#REF!"},{"$error":"#REF!"},{"$error":"#REF!"},{"$error":"#REF!"},{"$error":"#REF!"},{"$error":"#REF!"},{"$error":"#REF!"},{"$error":"#REF!"},{"$error":"#REF!"},{"$error":"#REF!"}]
[242,{"$error":"#REF!"},{"$error":"#REF!"},{"$error":"#REF!"},{"$error":"#REF!"},{"$error":"#REF!"},{"$error":"#REF!"},{"$error":"#REF!"},{"$error":"#REF!"},{"$error":"#REF!"},{"$error":"#REF!"},{"$error":"#REF!"},{"$error":"#REF!"},{"$error":"#REF!"}]
[243,{"$error":"#REF!"},{"$error":"#REF!"},{"$error":"#REF!"},{"$error":"#REF!"},{"$error":"#REF!"},{"$error":"#REF!"},{"$error":"#REF!"},{"$error":"#REF!"},{"$error":"#REF!"},{"$error":"#REF!"},{"$error":"#REF!"},{"$error":"#REF!"},{"$error":"#REF!"}]
[244,{"$error":"#REF!"},{"$error":"#REF!"},{"$error":"#REF!"},{"$error":"#REF!"},{"$error":"#REF!"},{"$error":"#REF!"},{"$error":"#REF!"},{"$error":"#REF!"},{"$error":"#REF!"},{"$error":"#REF!"},{"$error":"#REF!"},{"$error":"#REF!"},{"$error":"#REF!"}]
[245,{"$error":"#REF!"},{"$error":"#REF!"},{"$error":"#REF!"},{"$error":"#REF!"},{"$error":"#REF!"},{"$error":"#REF!"},{"$error":"#REF!"},{"$error":"#REF!"},{"$error":"#REF!"},{"$error":"#REF!"},{"$error":"#REF!"},{"$error":"#REF!"},{"$error":"#REF!"}]
[246,{"$error":"#REF!"},{"$error":"#REF!"},{"$error":"#REF!"},{"$error":"#REF!"},{"$error":"#REF!"},{"$error":"#REF!"},{"$error":"#REF!"},{"$error":"#REF!"},{"$error":"#REF!"},{"$error":"#REF!"},{"$error":"#REF!"},{"$error":"#REF!"},{"$error":"#REF!"}]
[247,{"$error":"#REF!"},{"$error":"#REF!"},{"$error":"#REF!"},{"$error":"#REF!"},{"$error":"#REF!"},{"$error":"#REF!"},{"$error":"#REF!"},{"$error":"#REF!"},{"$error":"#REF!"},{"$error":"#REF!"},{"$error":"#REF!"},{"$error":"#REF!"},{"$error":"#REF!"}]
[248,{"$error":"#REF!"},{"$error":"#REF!"},{"$error":"#REF!"},{"$error":"#REF!"},{"$error":"#REF!"},{"$error":"#REF!"},{"$error":"#REF!"},{"$error":"#REF!"},{"$error":"#REF!"},{"$error":"#REF!"},{"$error":"#REF!"},{"$error":"#REF!"},{"$error":"#REF!"}]
[249,{"$error":"#REF!"},{"$error":"#REF!"},{"$error":"#REF!"},{"$error":"#REF!"},{"$error":"#REF!"},{"$error":"#REF!"},{"$error":"#REF!"},{"$error":"#REF!"},{"$error":"#REF!"},{"$error":"#REF!"},{"$error":"#REF!"},{"$error":"#REF!"},{"$error":"#REF!"}]
[250,{"$error":"#REF!"},{"$error":"#REF!"},{"$error":"#REF!"},{"$error":"#REF!"},{"$error":"#REF!"},{"$error":"#REF!"},{"$error":"#REF!"},{"$error":"#REF!"},{"$error":"#REF!"},{"$error":"#REF!"},{"$error":"#REF!"},{"$error":"#REF!"},{"$error":"#REF!"}]
[251,{"$error":"#REF!"},{"$error":"#REF!"},{"$error":"#REF!"},{"$error":"#REF!"},{"$error":"#REF!"},{"$error":"#REF!"},{"$error":"#REF!"},{"$error":"#REF!"},{"$error":"#REF!"},{"$error":"#REF!"},{"$error":"#REF!"},{"$error":"#REF!"},{"$error":"#REF!"}]
[252,{"$error":"#REF!"},{"$error":"#REF!"},{"$error":"#REF!"},{"$error":"#REF!"},{"$error":"#REF!"},{"$error":"#REF!"},{"$error":"#REF!"},{"$error":"#REF!"},{"$error":"#REF!"},{"$error":"#REF!"},{"$error":"#REF!"},{"$error":"#REF!"},{"$error":"#REF!"}]
[253,{"$error":"#REF!"},{"$error":"#REF!"},{"$error":"#REF!"},{"$error":"#REF!"},{"$error":"#REF!"},{"$error":"#REF!"},{"$error":"#REF!"},{"$error":"#REF!"},{"$error":"#REF!"},{"$error":"#REF!"},{"$error":"#REF!"},{"$error":"#REF!"},{"$error":"#REF!"}]
[254,{"$error":"#REF!"},{"$error":"#REF!"},{"$error":"#REF!"},{"$error":"#REF!"},{"$error":"#REF!"},{"$error":"#REF!"},{"$error":"#REF!"},{"$error":"#REF!"},{"$error":"#REF!"},{"$error":"#REF!"},{"$error":"#REF!"},{"$error":"#REF!"},{"$error":"#REF!"}]
[255,{"$error":"#REF!"},{"$error":"#REF!"},{"$error":"#REF!"},{"$error":"#REF!"},{"$error":"#REF!"},{"$error":"#REF!"},{"$error":"#REF!"},{"$error":"#REF!"},{"$error":"#REF!"},{"$error":"#REF!"},{"$error":"#REF!"},{"$error":"#REF!"},{"$error":"#REF!"}]
[256,{"$error":"#REF!"},{"$error":"#REF!"},{"$error":"#REF!"},{"$error":"#REF!"},{"$error":"#REF!"},{"$error":"#REF!"},{"$error":"#REF!"},{"$error":"#REF!"},{"$error":"#REF!"},{"$error":"#REF!"},{"$error":"#REF!"},{"$error":"#REF!"},{"$error":"#REF!"}]
[257,{"$error":"#REF!"},{"$error":"#REF!"},{"$f":"$G$49","v":{"$error":"#REF!"}},{"$error":"#REF!"},{"$error":"#REF!"},{"$error":"#REF!"},{"$error":"#REF!"},{"$error":"#REF!"},{"$error":"#REF!"},{"$error":"#REF!"},{"$error":"#REF!"},{"$error":"#REF!"},{"$error":"#REF!"}]
[258,{"$error":"#REF!"},{"$f":"B354","v":{"$error":"#REF!"}},{"$error":"#REF!"},{"$error":"#REF!"},{"$f":"+$C$80+$H$80","v":{"$error":"#REF!"}},{"$f":"+$C$78+$H$78","v":{"$error":"#REF!"}},{"$f":"+$C$76+$C$84","v":{"$error":"#REF!"}},{"$f":"D354-E354-F354-G354-H354","v":{"$error":"#REF!"}},{"$error":"#REF!"},{"$error":"#REF!"},{"$error":"#REF!"},{"$error":"#REF!"},{"$f":"M354-K354","v":{"$error":"#REF!"}}]
[259,{"$f":"DATE(YEAR(B354),MONTH(B354)+1,DAY(B354))","v":{"$error":"#REF!"}},{"$error":"#REF!"},{"$error":"#REF!"},{"$f":"+$C$82+$H$82","v":{"$error":"#REF!"}},{"$error":"#REF!"},{"$error":"#REF!"},{"$error":"#REF!"},{"$error":"#REF!"},{"$error":"#REF!"},{"$error":"#REF!"},{"$f":"M354+I355","v":{"$error":"#REF!"}},{"$f":"L355*(1+$C$44)","v":{"$error":"#REF!"}},{"$error":"#REF!"}]
[260,{"$error":"#REF!"},{"$error":"#REF!"},{"$error":"#REF!"},{"$error":"#REF!"},{"$error":"#REF!"},{"$error":"#REF!"},{"$error":"#REF!"},{"$error":"#REF!"},{"$f":"+K355+I356","v":{"$error":"#REF!"}},{"$error":"#REF!"},{"$error":"#REF!"},{"$error":"#REF!"},{"$error":"#REF!"}]
[261,{"$error":"#REF!"},{"$error":"#REF!"},{"$error":"#REF!"},{"$error":"#REF!"},{"$error":"#REF!"},{"$error":"#REF!"},{"$error":"#REF!"},{"$error":"#REF!"},{"$error":"#REF!"},{"$f":"+(1+$C$42)*J357","v":{"$error":"#REF!"}},{"$error":"#REF!"},{"$error":"#REF!"},{"$error":"#REF!"}]
[262,{"$error":"#REF!"},{"$error":"#REF!"},{"$error":"#REF!"},{"$error":"#REF!"},{"$error":"#REF!"},{"$error":"#REF!"},{"$error":"#REF!"},{"$error":"#REF!"},{"$error":"#REF!"},{"$error":"#REF!"},{"$error":"#REF!"},{"$error":"#REF!"},{"$error":"#REF!"}]
[263,{"$error":"#REF!"},{"$error":"#REF!"},{"$error":"#REF!"},{"$error":"#REF!"},{"$error":"#REF!"},{"$error":"#REF!"},{"$error":"#REF!"},{"$error":"#REF!"},{"$error":"#REF!"},{"$error":"#REF!"},{"$error":"#REF!"},{"$error":"#REF!"},{"$error":"#REF!"}]
[264,{"$error":"#REF!"},{"$error":"#REF!"},{"$error":"#REF!"},{"$error":"#REF!"},{"$error":"#REF!"},{"$error":"#REF!"},{"$error":"#REF!"},{"$error":"#REF!"},{"$error":"#REF!"},{"$error":"#REF!"},{"$error":"#REF!"},{"$error":"#REF!"},{"$error":"#REF!"}]
[265,{"$error":"#REF!"},{"$error":"#REF!"},{"$error":"#REF!"},{"$error":"#REF!"},{"$error":"#REF!"},{"$error":"#REF!"},{"$error":"#REF!"},{"$error":"#REF!"},{"$error":"#REF!"},{"$error":"#REF!"},{"$error":"#REF!"},{"$error":"#REF!"},{"$error":"#REF!"}]
[266,{"$error":"#REF!"},{"$error":"#REF!"},{"$error":"#REF!"},{"$error":"#REF!"},{"$error":"#REF!"},{"$error":"#REF!"},{"$error":"#REF!"},{"$error":"#REF!"},{"$error":"#REF!"},{"$error":"#REF!"},{"$error":"#REF!"},{"$error":"#REF!"},{"$error":"#REF!"}]
[267,{"$error":"#REF!"},{"$error":"#REF!"},{"$error":"#REF!"},{"$error":"#REF!"},{"$error":"#REF!"},{"$error":"#REF!"},{"$error":"#REF!"},{"$error":"#REF!"},{"$error":"#REF!"},{"$error":"#REF!"},{"$error":"#REF!"},{"$error":"#REF!"},{"$error":"#REF!"}]
[268,{"$error":"#REF!"},{"$error":"#REF!"},{"$error":"#REF!"},{"$error":"#REF!"},{"$error":"#REF!"},{"$error":"#REF!"},{"$error":"#REF!"},{"$error":"#REF!"},{"$error":"#REF!"},{"$error":"#REF!"},{"$error":"#REF!"},{"$error":"#REF!"},{"$error":"#REF!"}]
[269,{"$error":"#REF!"},{"$error":"#REF!"},{"$error":"#REF!"},{"$error":"#REF!"},{"$error":"#REF!"},{"$error":"#REF!"},{"$error":"#REF!"},{"$error":"#REF!"},{"$error":"#REF!"},{"$error":"#REF!"},{"$error":"#REF!"},{"$error":"#REF!"},{"$error":"#REF!"}]
[270,{"$error":"#REF!"},{"$error":"#REF!"},{"$error":"#REF!"},{"$error":"#REF!"},{"$error":"#REF!"},{"$error":"#REF!"},{"$error":"#REF!"},{"$error":"#REF!"},{"$error":"#REF!"},{"$error":"#REF!"},{"$error":"#REF!"},{"$error":"#REF!"},{"$error":"#REF!"}]
[271,{"$error":"#REF!"},{"$error":"#REF!"},{"$error":"#REF!"},{"$error":"#REF!"},{"$error":"#REF!"},{"$error":"#REF!"},{"$error":"#REF!"},{"$error":"#REF!"},{"$error":"#REF!"},{"$error":"#REF!"},{"$error":"#REF!"},{"$error":"#REF!"},{"$error":"#REF!"}]
[272,{"$error":"#REF!"},{"$error":"#REF!"},{"$error":"#REF!"},{"$error":"#REF!"},{"$error":"#REF!"},{"$error":"#REF!"},{"$error":"#REF!"},{"$error":"#REF!"},{"$error":"#REF!"},{"$error":"#REF!"},{"$error":"#REF!"},{"$error":"#REF!"},{"$error":"#REF!"}]
[273,{"$error":"#REF!"},{"$error":"#REF!"},{"$error":"#REF!"},{"$error":"#REF!"},{"$error":"#REF!"},{"$error":"#REF!"},{"$error":"#REF!"},{"$error":"#REF!"},{"$error":"#REF!"},{"$error":"#REF!"},{"$error":"#REF!"},{"$error":"#REF!"},{"$error":"#REF!"}]
[274,{"$error":"#REF!"},{"$error":"#REF!"},{"$error":"#REF!"},{"$error":"#REF!"},{"$error":"#REF!"},{"$error":"#REF!"},{"$error":"#REF!"},{"$error":"#REF!"},{"$error":"#REF!"},{"$error":"#REF!"},{"$error":"#REF!"},{"$error":"#REF!"},{"$error":"#REF!"}]
[275,{"$error":"#REF!"},{"$error":"#REF!"},{"$error":"#REF!"},{"$error":"#REF!"},{"$error":"#REF!"},{"$error":"#REF!"},{"$error":"#REF!"},{"$error":"#REF!"},{"$error":"#REF!"},{"$error":"#REF!"},{"$error":"#REF!"},{"$error":"#REF!"},{"$error":"#REF!"}]
[276,{"$error":"#REF!"},{"$error":"#REF!"},{"$error":"#REF!"},{"$error":"#REF!"},{"$error":"#REF!"},{"$error":"#REF!"},{"$error":"#REF!"},{"$error":"#REF!"},{"$error":"#REF!"},{"$error":"#REF!"},{"$error":"#REF!"},{"$error":"#REF!"},{"$error":"#REF!"}]
[277,{"$error":"#REF!"},{"$error":"#REF!"},{"$error":"#REF!"},{"$error":"#REF!"},{"$error":"#REF!"},{"$error":"#REF!"},{"$error":"#REF!"},{"$error":"#REF!"},{"$error":"#REF!"},{"$error":"#REF!"},{"$error":"#REF!"},{"$error":"#REF!"},{"$error":"#REF!"}]
[278,{"$error":"#REF!"},{"$error":"#REF!"},{"$error":"#REF!"},{"$error":"#REF!"},{"$error":"#REF!"},{"$error":"#REF!"},{"$error":"#REF!"},{"$error":"#REF!"},{"$error":"#REF!"},{"$error":"#REF!"},{"$error":"#REF!"},{"$error":"#REF!"},{"$error":"#REF!"}]
[279,{"$error":"#REF!"},{"$error":"#REF!"},{"$error":"#REF!"},{"$error":"#REF!"},{"$error":"#REF!"},{"$error":"#REF!"},{"$error":"#REF!"},{"$error":"#REF!"},{"$error":"#REF!"},{"$error":"#REF!"},{"$error":"#REF!"},{"$error":"#REF!"},{"$error":"#REF!"}]
[280,{"$error":"#REF!"},{"$error":"#REF!"},{"$error":"#REF!"},{"$error":"#REF!"},{"$error":"#REF!"},{"$error":"#REF!"},{"$error":"#REF!"},{"$error":"#REF!"},{"$error":"#REF!"},{"$error":"#REF!"},{"$error":"#REF!"},{"$error":"#REF!"},{"$error":"#REF!"}]
[281,{"$error":"#REF!"},{"$error":"#REF!"},{"$error":"#REF!"},{"$error":"#REF!"},{"$error":"#REF!"},{"$error":"#REF!"},{"$error":"#REF!"},{"$error":"#REF!"},{"$error":"#REF!"},{"$error":"#REF!"},{"$error":"#REF!"},{"$error":"#REF!"},{"$error":"#REF!"}]
[282,{"$error":"#REF!"},{"$error":"#REF!"},{"$error":"#REF!"},{"$error":"#REF!"},{"$error":"#REF!"},{"$error":"#REF!"},{"$error":"#REF!"},{"$error":"#REF!"},{"$error":"#REF!"},{"$error":"#REF!"},{"$error":"#REF!"},{"$error":"#REF!"},{"$error":"#REF!"}]
[283,{"$error":"#REF!"},{"$error":"#REF!"},{"$error":"#REF!"},{"$error":"#REF!"},{"$error":"#REF!"},{"$error":"#REF!"},{"$error":"#REF!"},{"$error":"#REF!"},{"$error":"#REF!"},{"$error":"#REF!"},{"$error":"#REF!"},{"$error":"#REF!"},{"$error":"#REF!"}]
[284,{"$error":"#REF!"},{"$error":"#REF!"},{"$error":"#REF!"},{"$error":"#REF!"},{"$error":"#REF!"},{"$error":"#REF!"},{"$error":"#REF!"},{"$error":"#REF!"},{"$error":"#REF!"},{"$error":"#REF!"},{"$error":"#REF!"},{"$error":"#REF!"},{"$error":"#REF!"}]
[285,{"$error":"#REF!"},{"$error":"#REF!"},{"$error":"#REF!"},{"$error":"#REF!"},{"$error":"#REF!"},{"$error":"#REF!"},{"$error":"#REF!"},{"$error":"#REF!"},{"$error":"#REF!"},{"$error":"#REF!"},{"$error":"#REF!"},{"$error":"#REF!"},{"$error":"#REF!"}]
[286,{"$error":"#REF!"},{"$error":"#REF!"},{"$error":"#REF!"},{"$error":"#REF!"},{"$error":"#REF!"},{"$error":"#REF!"},{"$error":"#REF!"},{"$error":"#REF!"},{"$error":"#REF!"},{"$error":"#REF!"},{"$error":"#REF!"},{"$error":"#REF!"},{"$error":"#REF!"}]
[287,{"$error":"#REF!"},{"$error":"#REF!"},{"$error":"#REF!"},{"$error":"#REF!"},{"$error":"#REF!"},{"$error":"#REF!"},{"$error":"#REF!"},{"$error":"#REF!"},{"$error":"#REF!"},{"$error":"#REF!"},{"$error":"#REF!"},{"$error":"#REF!"},{"$error":"#REF!"}]
[288,{"$error":"#REF!"},{"$error":"#REF!"},{"$error":"#REF!"},{"$error":"#REF!"},{"$error":"#REF!"},{"$error":"#REF!"},{"$error":"#REF!"},{"$error":"#REF!"},{"$error":"#REF!"},{"$error":"#REF!"},{"$error":"#REF!"},{"$error":"#REF!"},{"$error":"#REF!"}]
[289,{"$error":"#REF!"},{"$error":"#REF!"},{"$error":"#REF!"},{"$error":"#REF!"},{"$error":"#REF!"},{"$error":"#REF!"},{"$error":"#REF!"},{"$error":"#REF!"},{"$error":"#REF!"},{"$error":"#REF!"},{"$error":"#REF!"},{"$error":"#REF!"},{"$error":"#REF!"}]
[290,{"$error":"#REF!"},{"$error":"#REF!"},{"$error":"#REF!"},{"$error":"#REF!"},{"$error":"#REF!"},{"$error":"#REF!"},{"$error":"#REF!"},{"$error":"#REF!"},{"$error":"#REF!"},{"$error":"#REF!"},{"$error":"#REF!"},{"$error":"#REF!"},{"$error":"#REF!"}]
[291,{"$error":"#REF!"},{"$error":"#REF!"},{"$error":"#REF!"},{"$error":"#REF!"},{"$error":"#REF!"},{"$error":"#REF!"},{"$error":"#REF!"},{"$error":"#REF!"},{"$error":"#REF!"},{"$error":"#REF!"},{"$error":"#REF!"},{"$error":"#REF!"},{"$error":"#REF!"}]
[null,null,"00:00:00",{"$error":"#REF!"},{"$error":"#REF!"},{"$error":"#REF!"},{"$error":"#REF!"},{"$error":"#REF!"},{"$error":"#REF!"},{"$error":"#REF!"},{"$error":"#REF!"},{"$error":"#REF!"},{"$error":"#REF!"},{"$error":"#REF!"}]
[null,null,"00:00:00",{"$error":"#REF!"},{"$error":"#REF!"},{"$error":"#REF!"},{"$error":"#REF!"},{"$error":"#REF!"},{"$error":"#REF!"},{"$error":"#REF!"},{"$error":"#REF!"},{"$error":"#REF!"},{"$error":"#REF!"},{"$error":"#REF!"}]
[null,null,"00:00:00",{"$error":"#REF!"},{"$error":"#REF!"},{"$error":"#REF!"},{"$error":"#REF!"},{"$error":"#REF!"},{"$error":"#REF!"},{"$error":"#REF!"},{"$error":"#REF!"},{"$error":"#REF!"},{"$error":"#REF!"},{"$error":"#REF!"}]
[null,null,"00:00:00",{"$error":"#REF!"},{"$error":"#REF!"},{"$error":"#REF!"},{"$error":"#REF!"},{"$error":"#REF!"},{"$error":"#REF!"},{"$error":"#REF!"},{"$error":"#REF!"},{"$error":"#REF!"},{"$error":"#REF!"},{"$error":"#REF!"}]
[null,null,"00:00:00",{"$error":"#REF!"},{"$error":"#REF!"},{"$error":"#REF!"},{"$error":"#REF!"},{"$error":"#REF!"},{"$error":"#REF!"},{"$error":"#REF!"},{"$error":"#REF!"},{"$error":"#REF!"},{"$error":"#REF!"},{"$error":"#REF!"}]
[null,null,"00:00:00",{"$error":"#REF!"},{"$error":"#REF!"},{"$error":"#REF!"},{"$error":"#REF!"},{"$error":"#REF!"},{"$error":"#REF!"},{"$error":"#REF!"},{"$error":"#REF!"},{"$error":"#REF!"},{"$error":"#REF!"},{"$error":"#REF!"}]
[null,null,"00:00:00",{"$error":"#REF!"},{"$error":"#REF!"},{"$error":"#REF!"},{"$error":"#REF!"},{"$error":"#REF!"},{"$error":"#REF!"},{"$error":"#REF!"},{"$error":"#REF!"},{"$error":"#REF!"},{"$error":"#REF!"},{"$error":"#REF!"}]
[null,null,"00:00:00",{"$error":"#REF!"},{"$error":"#REF!"},{"$error":"#REF!"},{"$error":"#REF!"},{"$error":"#REF!"},{"$error":"#REF!"},{"$error":"#REF!"},{"$error":"#REF!"},{"$error":"#REF!"},{"$error":"#REF!"},{"$error":"#REF!"}]
[null,null,"00:00:00",{"$error":"#REF!"},{"$error":"#REF!"},{"$error":"#REF!"},{"$error":"#REF!"},{"$error":"#REF!"},{"$error":"#REF!"},{"$error":"#REF!"},{"$error":"#REF!"},{"$error":"#REF!"},{"$error":"#REF!"},{"$error":"#REF!"}]
[null,null,"00:00:00",{"$error":"#REF!"},{"$error":"#REF!"},{"$error":"#REF!"},{"$error":"#REF!"},{"$error":"#REF!"},{"$error":"#REF!"},{"$error":"#REF!"},{"$error":"#REF!"},{"$error":"#REF!"},{"$error":"#REF!"},{"$error":"#REF!"}]
[null,null,"00:00:00",{"$error":"#REF!"},{"$error":"#REF!"},{"$error":"#REF!"},{"$error":"#REF!"},{"$error":"#REF!"},{"$error":"#REF!"},{"$error":"#REF!"},{"$error":"#REF!"},{"$error":"#REF!"},{"$error":"#REF!"},{"$error":"#REF!"}]
[null,null,"00:00:00",{"$error":"#REF!"},{"$error":"#REF!"},{"$error":"#REF!"},{"$error":"#REF!"},{"$error":"#REF!"},{"$error":"#REF!"},{"$error":"#REF!"},{"$error":"#REF!"},{"$error":"#REF!"},{"$error":"#REF!"},{"$error":"#REF!"}]
[null,null,"00:00:00",{"$error":"#REF!"},{"$error":"#REF!"},{"$error":"#REF!"},{"$error":"#REF!"},{"$error":"#REF!"},{"$error":"#REF!"},{"$error":"#REF!"},{"$error":"#REF!"},{"$error":"#REF!"},{"$error":"#REF!"},{"$error":"#REF!"}]
[null,null,"00:00:00",{"$error":"#REF!"},{"$error":"#REF!"},{"$error":"#REF!"},{"$error":"#REF!"},{"$error":"#REF!"},{"$error":"#REF!"},{"$error":"#REF!"},{"$error":"#REF!"},{"$error":"#REF!"},{"$error":"#REF!"},{"$error":"#REF!"}]
[null,null,"00:00:00",{"$error":"#REF!"},{"$error":"#REF!"},{"$error":"#REF!"},{"$error":"#REF!"},{"$error":"#REF!"},{"$error":"#REF!"},{"$error":"#REF!"},{"$error":"#REF!"},{"$error":"#REF!"},{"$error":"#REF!"},{"$error":"#REF!"}]
[null,null,"00:00:00",{"$error":"#REF!"},{"$error":"#REF!"},{"$error":"#REF!"},{"$error":"#REF!"},{"$error":"#REF!"},{"$error":"#REF!"},{"$error":"#REF!"},{"$error":"#REF!"},{"$error":"#REF!"},{"$error":"#REF!"},{"$error":"#REF!"}]
[null,null,"00:00:00",{"$error":"#REF!"},{"$error":"#REF!"},{"$error":"#REF!"},{"$error":"#REF!"},{"$error":"#REF!"},{"$error":"#REF!"},{"$error":"#REF!"},{"$error":"#REF!"},{"$error":"#REF!"},{"$error":"#REF!"},{"$error":"#REF!"}]
[null,null,"00:00:00",{"$error":"#REF!"},{"$error":"#REF!"},{"$error":"#REF!"},{"$error":"#REF!"},{"$error":"#REF!"},{"$error":"#REF!"},{"$error":"#REF!"},{"$error":"#REF!"},{"$error":"#REF!"},{"$error":"#REF!"},{"$error":"#REF!"}]
[null,null,"00:00:00",{"$error":"#REF!"},{"$error":"#REF!"},{"$error":"#REF!"},{"$error":"#REF!"},{"$error":"#REF!"},{"$error":"#REF!"},{"$error":"#REF!"},{"$error":"#REF!"},{"$error":"#REF!"},{"$error":"#REF!"},{"$error":"#REF!"}]
[null,null,"00:00:00",{"$error":"#REF!"},{"$error":"#REF!"},{"$error":"#REF!"},{"$error":"#REF!"},{"$error":"#REF!"},{"$error":"#REF!"},{"$error":"#REF!"},{"$error":"#REF!"},{"$error":"#REF!"},{"$error":"#REF!"},{"$error":"#REF!"}]
[null,null,"00:00:00",{"$error":"#REF!"},{"$error":"#REF!"},{"$error":"#REF!"},{"$error":"#REF!"},{"$error":"#REF!"},{"$error":"#REF!"},{"$error":"#REF!"},{"$error":"#REF!"},{"$error":"#REF!"},{"$error":"#REF!"},{"$error":"#REF!"}]
[null,null,"00:00:00",{"$error":"#REF!"},{"$error":"#REF!"},{"$error":"#REF!"},{"$error":"#REF!"},{"$error":"#REF!"},{"$error":"#REF!"},{"$error":"#REF!"},{"$error":"#REF!"},{"$error":"#REF!"},{"$error":"#REF!"},{"$error":"#REF!"}]
[null,null,"00:00:00",{"$error":"#REF!"},{"$error":"#REF!"},{"$error":"#REF!"},{"$error":"#REF!"},{"$error":"#REF!"},{"$error":"#REF!"},{"$error":"#REF!"},{"$error":"#REF!"},{"$error":"#REF!"},{"$error":"#REF!"},{"$error":"#REF!"}]
[null,null,"00:00:00",{"$error":"#REF!"},{"$error":"#REF!"},{"$error":"#REF!"},{"$error":"#REF!"},{"$error":"#REF!"},{"$error":"#REF!"},{"$error":"#REF!"},{"$error":"#REF!"},{"$error":"#REF!"},{"$error":"#REF!"},{"$error":"#REF!"}]
[null,null,"00:00:00",{"$error":"#REF!"},{"$error":"#REF!"},{"$error":"#REF!"},{"$error":"#REF!"},{"$error":"#REF!"},{"$error":"#REF!"},{"$error":"#REF!"},{"$error":"#REF!"},{"$error":"#REF!"},{"$error":"#REF!"},{"$error":"#REF!"}]
[null,null,"00:00:00",{"$error":"#REF!"},{"$error":"#REF!"},{"$error":"#REF!"},{"$error":"#REF!"},{"$error":"#REF!"},{"$error":"#REF!"},{"$error":"#REF!"},{"$error":"#REF!"},{"$error":"#REF!"},{"$error":"#REF!"},{"$error":"#REF!"}]
[null,null,"00:00:00",{"$error":"#REF!"},{"$error":"#REF!"},{"$error":"#REF!"},{"$error":"#REF!"},{"$error":"#REF!"},{"$error":"#REF!"},{"$error":"#REF!"},{"$error":"#REF!"},{"$error":"#REF!"},{"$error":"#REF!"},{"$error":"#REF!"}]
[null,null,"00:00:00",{"$error":"#REF!"},{"$error":"#REF!"},{"$error":"#REF!"},{"$error":"#REF!"},{"$error":"#REF!"},{"$error":"#REF!"},{"$error":"#REF!"},{"$error":"#REF!"},{"$error":"#REF!"},{"$error":"#REF!"},{"$error":"#REF!"}]
[null,null,"00:00:00",{"$error":"#REF!"},{"$error":"#REF!"},{"$error":"#REF!"},{"$error":"#REF!"},{"$error":"#REF!"},{"$error":"#REF!"},{"$error":"#REF!"},{"$error":"#REF!"},{"$error":"#REF!"},{"$error":"#REF!"},{"$error":"#REF!"}]
[null,null,"00:00:00",{"$f":"$G$49","v":{"$error":"#REF!"}},{"$error":"#REF!"},{"$error":"#REF!"},{"$error":"#REF!"},{"$error":"#REF!"},{"$error":"#REF!"},{"$error":"#REF!"},{"$error":"#REF!"},{"$error":"#REF!"},{"$error":"#REF!"},{"$error":"#REF!"}]
[null,null,{"$f":"B418","v":"00:00:00"},{"$error":"#REF!"},{"$error":"#REF!"},{"$f":"+$C$80+$H$80","v":{"$error":"#REF!"}},{"$f":"+$C$78+$H$78","v":{"$error":"#REF!"}},{"$f":"+$C$76+$C$84","v":{"$error":"#REF!"}},{"$f":"D418-E418-F418-G418-H418","v":{"$error":"#REF!"}},{"$error":"#REF!"},{"$error":"#REF!"},{"$error":"#REF!"},{"$error":"#REF!"},{"$f":"M418-K418","v":{"$error":"#REF!"}}]
[null,null,"00:00:00",{"$error":"#REF!"},{"$f":"+$C$82+$H$82","v":{"$error":"#REF!"}},{"$error":"#REF!"},{"$error":"#REF!"},{"$error":"#REF!"},{"$error":"#REF!"},{"$error":"#REF!"},{"$error":"#REF!"},{"$f":"M418+I419","v":{"$error":"#REF!"}},{"$f":"L419*(1+$C$44)","v":{"$error":"#REF!"}},{"$error":"#REF!"}]
[null,null,"00:00:00",{"$error":"#REF!"},{"$error":"#REF!"},{"$error":"#REF!"},{"$error":"#REF!"},{"$error":"#REF!"},{"$error":"#REF!"},{"$f":"+K419+I420","v":{"$error":"#REF!"}},{"$error":"#REF!"},{"$error":"#REF!"},{"$error":"#REF!"},{"$error":"#REF!"}]
[null,null,"00:00:00",{"$error":"#REF!"},{"$error":"#REF!"},{"$error":"#REF!"},{"$error":"#REF!"},{"$error":"#REF!"},{"$error":"#REF!"},{"$error":"#REF!"},{"$f":"+(1+$C$42)*J421","v":{"$error":"#REF!"}},{"$error":"#REF!"},{"$error":"#REF!"},{"$error":"#REF!"}]
[null,null,"00:00:00",{"$error":"#REF!"},{"$error":"#REF!"},{"$error":"#REF!"},{"$error":"#REF!"},{"$error":"#REF!"},{"$error":"#REF!"},{"$error":"#REF!"},{"$error":"#REF!"},{"$error":"#REF!"},{"$error":"#REF!"},{"$error":"#REF!"}]
[null,null,"00:00:00",{"$error":"#REF!"},{"$error":"#REF!"},{"$error":"#REF!"},{"$error":"#REF!"},{"$error":"#REF!"},{"$error":"#REF!"},{"$error":"#REF!"},{"$error":"#REF!"},{"$error":"#REF!"},{"$error":"#REF!"},{"$error":"#REF!"}]
[null,null,"00:00:00",{"$error":"#REF!"},{"$error":"#REF!"},{"$error":"#REF!"},{"$error":"#REF!"},{"$error":"#REF!"},{"$error":"#REF!"},{"$error":"#REF!"},{"$error":"#REF!"},{"$error":"#REF!"},{"$error":"#REF!"},{"$error":"#REF!"}]
[null,null,"00:00:00",{"$error":"#REF!"},{"$error":"#REF!"},{"$error":"#REF!"},{"$error":"#REF!"},{"$error":"#REF!"},{"$error":"#REF!"},{"$error":"#REF!"},{"$error":"#REF!"},{"$error":"#REF!"},{"$error":"#REF!"},{"$error":"#REF!"}]
[null,null,"00:00:00",{"$error":"#REF!"},{"$error":"#REF!"},{"$error":"#REF!"},{"$error":"#REF!"},{"$error":"#REF!"},{"$error":"#REF!"},{"$error":"#REF!"},{"$error":"#REF!"},{"$error":"#REF!"},{"$error":"#REF!"},{"$error":"#REF!"}]
[null,null,"00:00:00",{"$error":"#REF!"},{"$error":"#REF!"},{"$error":"#REF!"},{"$error":"#REF!"},{"$error":"#REF!"},{"$error":"#REF!"},{"$error":"#REF!"},{"$error":"#REF!"},{"$error":"#REF!"},{"$error":"#REF!"},{"$error":"#REF!"}]
[null,null,"00:00:00",{"$error":"#REF!"},{"$error":"#REF!"},{"$error":"#REF!"},{"$error":"#REF!"},{"$error":"#REF!"},{"$error":"#REF!"},{"$error":"#REF!"},{"$error":"#REF!"},{"$error":"#REF!"},{"$error":"#REF!"},{"$error":"#REF!"}]
[null,null,"00:00:00",{"$error":"#REF!"},{"$error":"#REF!"},{"$error":"#REF!"},{"$error":"#REF!"},{"$error":"#REF!"},{"$error":"#REF!"},{"$error":"#REF!"},{"$error":"#REF!"},{"$error":"#REF!"},{"$error":"#REF!"},{"$error":"#REF!"}]
[null,null,"00:00:00",{"$error":"#REF!"},{"$error":"#REF!"},{"$error":"#REF!"},{"$error":"#REF!"},{"$error":"#REF!"},{"$error":"#REF!"},{"$error":"#REF!"},{"$error":"#REF!"},{"$error":"#REF!"},{"$error":"#REF!"},{"$error":"#REF!"}]
[null,null,"00:00:00",{"$error":"#REF!"},{"$error":"#REF!"},{"$error":"#REF!"},{"$error":"#REF!"},{"$error":"#REF!"},{"$error":"#REF!"},{"$error":"#REF!"},{"$error":"#REF!"},{"$error":"#REF!"},{"$error":"#REF!"},{"$error":"#REF!"}]
[null,null,"00:00:00",{"$error":"#REF!"},{"$error":"#REF!"},{"$error":"#REF!"},{"$error":"#REF!"},{"$error":"#REF!"},{"$error":"#REF!"},{"$error":"#REF!"},{"$error":"#REF!"},{"$error":"#REF!"},{"$error":"#REF!"},{"$error":"#REF!"}]
[null,null,"00:00:00",{"$error":"#REF!"},{"$error":"#REF!"},{"$error":"#REF!"},{"$error":"#REF!"},{"$error":"#REF!"},{"$error":"#REF!"},{"$error":"#REF!"},{"$error":"#REF!"},{"$error":"#REF!"},{"$error":"#REF!"},{"$error":"#REF!"}]
[null,null,"00:00:00",{"$error":"#REF!"},{"$error":"#REF!"},{"$error":"#REF!"},{"$error":"#REF!"},{"$error":"#REF!"},{"$error":"#REF!"},{"$error":"#REF!"},{"$error":"#REF!"},{"$error":"#REF!"},{"$error":"#REF!"},{"$error":"#REF!"}]
[null,null,"00:00:00",{"$error":"#REF!"},{"$error":"#REF!"},{"$error":"#REF!"},{"$error":"#REF!"},{"$error":"#REF!"},{"$error":"#REF!"},{"$error":"#REF!"},{"$error":"#REF!"},{"$error":"#REF!"},{"$error":"#REF!"},{"$error":"#REF!"}]
[null,null,"00:00:00",{"$error":"#REF!"},{"$error":"#REF!"},{"$error":"#REF!"},{"$error":"#REF!"},{"$error":"#REF!"},{"$error":"#REF!"},{"$error":"#REF!"},{"$error":"#REF!"},{"$error":"#REF!"},{"$error":"#REF!"},{"$error":"#REF!"}]
[null,null,"00:00:00",{"$error":"#REF!"},{"$error":"#REF!"},{"$error":"#REF!"},{"$error":"#REF!"},{"$error":"#REF!"},{"$error":"#REF!"},{"$error":"#REF!"},{"$error":"#REF!"},{"$error":"#REF!"},{"$error":"#REF!"},{"$error":"#REF!"}]
[null,null,"00:00:00",{"$error":"#REF!"},{"$error":"#REF!"},{"$error":"#REF!"},{"$error":"#REF!"},{"$error":"#REF!"},{"$error":"#REF!"},{"$error":"#REF!"},{"$error":"#REF!"},{"$error":"#REF!"},{"$error":"#REF!"},{"$error":"#REF!"}]
[null,null,"00:00:00",{"$error":"#REF!"},{"$error":"#REF!"},{"$error":"#REF!"},{"$error":"#REF!"},{"$error":"#REF!"},{"$error":"#REF!"},{"$error":"#REF!"},{"$error":"#REF!"},{"$error":"#REF!"},{"$error":"#REF!"},{"$error":"#REF!"}]
[null,null,"00:00:00",{"$error":"#REF!"},{"$error":"#REF!"},{"$error":"#REF!"},{"$error":"#REF!"},{"$error":"#REF!"},{"$error":"#REF!"},{"$error":"#REF!"},{"$error":"#REF!"},{"$error":"#REF!"},{"$error":"#REF!"},{"$error":"#REF!"}]
[null,null,"00:00:00",{"$error":"#REF!"},{"$error":"#REF!"},{"$error":"#REF!"},{"$error":"#REF!"},{"$error":"#REF!"},{"$error":"#REF!"},{"$error":"#REF!"},{"$error":"#REF!"},{"$error":"#REF!"},{"$error":"#REF!"},{"$error":"#REF!"}]
[null,null,"00:00:00",{"$error":"#REF!"},{"$error":"#REF!"},{"$error":"#REF!"},{"$error":"#REF!"},{"$error":"#REF!"},{"$error":"#REF!"},{"$error":"#REF!"},{"$error":"#REF!"},{"$error":"#REF!"},{"$error":"#REF!"},{"$error":"#REF!"}]
[null,null,"00:00:00",{"$error":"#REF!"},{"$error":"#REF!"},{"$error":"#REF!"},{"$error":"#REF!"},{"$error":"#REF!"},{"$error":"#REF!"},{"$error":"#REF!"},{"$error":"#REF!"},{"$error":"#REF!"},{"$error":"#REF!"},{"$error":"#REF!"}]
[null,null,"00:00:00",{"$error":"#REF!"},{"$error":"#REF!"},{"$error":"#REF!"},{"$error":"#REF!"},{"$error":"#REF!"},{"$error":"#REF!"},{"$error":"#REF!"},{"$error":"#REF!"},{"$error":"#REF!"},{"$error":"#REF!"},{"$error":"#REF!"}]
[null,null,"00:00:00",{"$error":"#REF!"},{"$error":"#REF!"},{"$error":"#REF!"},{"$error":"#REF!"},{"$error":"#REF!"},{"$error":"#REF!"},{"$error":"#REF!"},{"$error":"#REF!"},{"$error":"#REF!"},{"$error":"#REF!"},{"$error":"#REF!"}]
[null,null,"00:00:00",{"$error":"#REF!"},{"$error":"#REF!"},{"$error":"#REF!"},{"$error":"#REF!"},{"$error":"#REF!"},{"$error":"#REF!"},{"$error":"#REF!"},{"$error":"#REF!"},{"$error":"#REF!"},{"$error":"#REF!"},{"$error":"#REF!"}]
[null,null,"00:00:00",{"$error":"#REF!"},{"$error":"#REF!"},{"$error":"#REF!"},{"$error":"#REF!"},{"$error":"#REF!"},{"$error":"#REF!"},{"$error":"#REF!"},{"$error":"#REF!"},{"$error":"#REF!"},{"$error":"#REF!"},{"$error":"#REF!"}]
[null,null,"00:00:00",{"$error":"#REF!"},{"$error":"#REF!"},{"$error":"#REF!"},{"$error":"#REF!"},{"$error":"#REF!"},{"$error":"#REF!"},{"$error":"#REF!"},{"$error":"#REF!"},{"$error":"#REF!"},{"$error":"#REF!"},{"$error":"#REF!"}]
[null,null,"00:00:00",{"$error":"#REF!"},{"$error":"#REF!"},{"$error":"#REF!"},{"$error":"#REF!"},{"$error":"#REF!"},{"$error":"#REF!"},{"$error":"#REF!"},{"$error":"#REF!"},{"$error":"#REF!"},{"$error":"#REF!"},{"$error":"#REF!"}]
[null,null,"00:00:00",{"$error":"#REF!"},{"$error":"#REF!"},{"$error":"#REF!"},{"$error":"#REF!"},{"$error":"#REF!"},{"$error":"#REF!"},{"$error":"#REF!"},{"$error":"#REF!"},{"$error":"#REF!"},{"$error":"#REF!"},{"$error":"#REF!"}]
[null,null,"00:00:00",{"$error":"#REF!"},{"$error":"#REF!"},{"$error":"#REF!"},{"$error":"#REF!"},{"$error":"#REF!"},{"$error":"#REF!"},{"$error":"#REF!"},{"$error":"#REF!"},{"$error":"#REF!"},{"$error":"#REF!"},{"$error":"#REF!"}]
[null,null,"00:00:00",{"$error":"#REF!"},{"$error":"#REF!"},{"$error":"#REF!"},{"$error":"#REF!"},{"$error":"#REF!"},{"$error":"#REF!"},{"$error":"#REF!"},{"$error":"#REF!"},{"$error":"#REF!"},{"$error":"#REF!"},{"$error":"#REF!"}]
[null,null,"00:00:00",{"$error":"#REF!"},{"$error":"#REF!"},{"$error":"#REF!"},{"$error":"#REF!"},{"$error":"#REF!"},{"$error":"#REF!"},{"$error":"#REF!"},{"$error":"#REF!"},{"$error":"#REF!"},{"$error":"#REF!"},{"$error":"#REF!"}]
[null,null,"00:00:00",{"$error":"#REF!"},{"$error":"#REF!"},{"$error":"#REF!"},{"$error":"#REF!"},{"$error":"#REF!"},{"$error":"#REF!"},{"$error":"#REF!"},{"$error":"#REF!"},{"$error":"#REF!"},{"$error":"#REF!"},{"$error":"#REF!"}]
[null,null,"00:00:00",{"$error":"#REF!"},{"$error":"#REF!"},{"$error":"#REF!"},{"$error":"#REF!"},{"$error":"#REF!"},{"$error":"#REF!"},{"$error":"#REF!"},{"$error":"#REF!"},{"$error":"#REF!"},{"$error":"#REF!"},{"$error":"#REF!"}]
[null,null,"00:00:00",{"$error":"#REF!"},{"$error":"#REF!"},{"$error":"#REF!"},{"$error":"#REF!"},{"$error":"#REF!"},{"$error":"#REF!"},{"$error":"#REF!"},{"$error":"#REF!"},{"$error":"#REF!"},{"$error":"#REF!"},{"$error":"#REF!"}]
[null,null,"00:00:00",{"$error":"#REF!"},{"$error":"#REF!"},{"$error":"#REF!"},{"$error":"#REF!"},{"$error":"#REF!"},{"$error":"#REF!"},{"$error":"#REF!"},{"$error":"#REF!"},{"$error":"#REF!"},{"$error":"#REF!"},{"$error":"#REF!"}]
[null,null,"00:00:00",{"$error":"#REF!"},{"$error":"#REF!"},{"$error":"#REF!"},{"$error":"#REF!"},{"$error":"#REF!"},{"$error":"#REF!"},{"$error":"#REF!"},{"$error":"#REF!"},{"$error":"#REF!"},{"$error":"#REF!"},{"$error":"#REF!"}]
[null,null,"00:00:00",{"$error":"#REF!"},{"$error":"#REF!"},{"$error":"#REF!"},{"$error":"#REF!"},{"$error":"#REF!"},{"$error":"#REF!"},{"$error":"#REF!"},{"$error":"#REF!"},{"$error":"#REF!"},{"$error":"#REF!"},{"$error":"#REF!"}]
[null,null,"00:00:00",{"$error":"#REF!"},{"$error":"#REF!"},{"$error":"#REF!"},{"$error":"#REF!"},{"$error":"#REF!"},{"$error":"#REF!"},{"$error":"#REF!"},{"$error":"#REF!"},{"$error":"#REF!"},{"$error":"#REF!"},{"$error":"#REF!"}]
[null,null,"00:00:00",{"$error":"#REF!"},{"$error":"#REF!"},{"$error":"#REF!"},{"$error":"#REF!"},{"$error":"#REF!"},{"$error":"#REF!"},{"$error":"#REF!"},{"$error":"#REF!"},{"$error":"#REF!"},{"$error":"#REF!"},{"$error":"#REF!"}]
[null,null,"00:00:00",{"$error":"#REF!"},{"$error":"#REF!"},{"$error":"#REF!"},{"$error":"#REF!"},{"$error":"#REF!"},{"$error":"#REF!"},{"$error":"#REF!"},{"$error":"#REF!"},{"$error":"#REF!"},{"$error":"#REF!"},{"$error":"#REF!"}]
[null,null,"00:00:00",{"$error":"#REF!"},{"$error":"#REF!"},{"$error":"#REF!"},{"$error":"#REF!"},{"$error":"#REF!"},{"$error":"#REF!"},{"$error":"#REF!"},{"$error":"#REF!"},{"$error":"#REF!"},{"$error":"#REF!"},{"$error":"#REF!"}]
[null,null,"00:00:00",{"$error":"#REF!"},{"$error":"#REF!"},{"$error":"#REF!"},{"$error":"#REF!"},{"$error":"#REF!"},{"$error":"#REF!"},{"$error":"#REF!"},{"$error":"#REF!"},{"$error":"#REF!"},{"$error":"#REF!"},{"$error":"#REF!"}]
[null,null,"00:00:00",{"$error":"#REF!"},{"$error":"#REF!"},{"$error":"#REF!"},{"$error":"#REF!"},{"$error":"#REF!"},{"$error":"#REF!"},{"$error":"#REF!"},{"$error":"#REF!"},{"$error":"#REF!"},{"$error":"#REF!"},{"$error":"#REF!"}]
[null,null,"00:00:00",{"$error":"#REF!"},{"$error":"#REF!"},{"$error":"#REF!"},{"$error":"#REF!"},{"$error":"#REF!"},{"$error":"#REF!"},{"$error":"#REF!"},{"$error":"#REF!"},{"$error":"#REF!"},{"$error":"#REF!"},{"$error":"#REF!"}]
[null,null,"00:00:00",{"$error":"#REF!"},{"$error":"#REF!"},{"$error":"#REF!"},{"$error":"#REF!"},{"$error":"#REF!"},{"$error":"#REF!"},{"$error":"#REF!"},{"$error":"#REF!"},{"$error":"#REF!"},{"$error":"#REF!"},{"$error":"#REF!"}]
[null,null,"00:00:00",{"$error":"#REF!"},{"$error":"#REF!"},{"$error":"#REF!"},{"$error":"#REF!"},{"$error":"#REF!"},{"$error":"#REF!"},{"$error":"#REF!"},{"$error":"#REF!"},{"$error":"#REF!"},{"$error":"#REF!"},{"$error":"#REF!"}]
[null,null,"00:00:00",{"$error":"#REF!"},{"$error":"#REF!"},{"$error":"#REF!"},{"$error":"#REF!"},{"$error":"#REF!"},{"$error":"#REF!"},{"$error":"#REF!"},{"$error":"#REF!"},{"$error":"#REF!"},{"$error":"#REF!"},{"$error":"#REF!"}]
[null,null,"00:00:00",{"$error":"#REF!"},{"$error":"#REF!"},{"$error":"#REF!"},{"$error":"#REF!"},{"$error":"#REF!"},{"$error":"#REF!"},{"$error":"#REF!"},{"$error":"#REF!"},{"$error":"#REF!"},{"$error":"#REF!"},{"$error":"#REF!"}]
[null,null,"00:00:00",{"$error":"#REF!"},{"$error":"#REF!"},{"$error":"#REF!"},{"$error":"#REF!"},{"$error":"#REF!"},{"$error":"#REF!"},{"$error":"#REF!"},{"$error":"#REF!"},{"$error":"#REF!"},{"$error":"#REF!"},{"$error":"#REF!"}]
[null,null,"00:00:00",{"$error":"#REF!"},{"$error":"#REF!"},{"$error":"#REF!"},{"$error":"#REF!"},{"$error":"#REF!"},{"$error":"#REF!"},{"$error":"#REF!"},{"$error":"#REF!"},{"$error":"#REF!"},{"$error":"#REF!"},{"$error":"#REF!"}]
[null,null,"00:00:00",{"$error":"#REF!"},{"$error":"#REF!"},{"$error":"#REF!"},{"$error":"#REF!"},{"$error":"#REF!"},{"$error":"#REF!"},{"$error":"#REF!"},{"$error":"#REF!"},{"$error":"#REF!"},{"$error":"#REF!"},{"$error":"#REF!"}]
[null,null,"00:00:00",{"$error":"#REF!"},{"$error":"#REF!"},{"$error":"#REF!"},{"$error":"#REF!"},{"$error":"#REF!"},{"$error":"#REF!"},{"$error":"#REF!"},{"$error":"#REF!"},{"$error":"#REF!"},{"$error":"#REF!"},{"$error":"#REF!"}]
[null,null,"00:00:00",{"$error":"#REF!"},{"$error":"#REF!"},{"$error":"#REF!"},{"$error":"#REF!"},{"$error":"#REF!"},{"$error":"#REF!"},{"$error":"#REF!"},{"$error":"#REF!"},{"$error":"#REF!"},{"$error":"#REF!"},{"$error":"#REF!"}]
[null,null,"00:00:00",{"$error":"#REF!"},{"$error":"#REF!"},{"$error":"#REF!"},{"$error":"#REF!"},{"$error":"#REF!"},{"$error":"#REF!"},{"$error":"#REF!"},{"$error":"#REF!"},{"$error":"#REF!"},{"$error":"#REF!"},{"$error":"#REF!"}]
[null,null,"00:00:00",{"$error":"#REF!"},{"$error":"#REF!"},{"$error":"#REF!"},{"$error":"#REF!"},{"$error":"#REF!"},{"$error":"#REF!"},{"$error":"#REF!"},{"$error":"#REF!"},{"$error":"#REF!"},{"$error":"#REF!"},{"$error":"#REF!"}]
[null,null,"00:00:00",{"$error":"#REF!"},{"$error":"#REF!"},{"$error":"#REF!"},{"$error":"#REF!"},{"$error":"#REF!"},{"$error":"#REF!"},{"$error":"#REF!"},{"$error":"#REF!"},{"$error":"#REF!"},{"$error":"#REF!"},{"$error":"#REF!"}]
[null,null,"00:00:00",{"$error":"#REF!"},{"$error":"#REF!"},{"$error":"#REF!"},{"$error":"#REF!"},{"$error":"#REF!"},{"$error":"#REF!"},{"$error":"#REF!"},{"$error":"#REF!"},{"$error":"#REF!"},{"$error":"#REF!"},{"$error":"#REF!"}]
[null,null,"00:00:00",{"$error":"#REF!"},{"$error":"#REF!"},{"$error":"#REF!"},{"$error":"#REF!"},{"$error":"#REF!"},{"$error":"#REF!"},{"$error":"#REF!"},{"$error":"#REF!"},{"$error":"#REF!"},{"$error":"#REF!"},{"$error":"#REF!"}]
[null,null,"00:00:00",{"$f":"$G$49","v":{"$error":"#REF!"}},{"$error":"#REF!"},{"$error":"#REF!"},{"$error":"#REF!"},{"$error":"#REF!"},{"$error":"#REF!"},{"$error":"#REF!"},{"$error":"#REF!"},{"$error":"#REF!"},{"$error":"#REF!"},{"$error":"#REF!"}]
[null,null,{"$f":"B482","v":"00:00:00"},{"$error":"#REF!"},{"$error":"#REF!"},{"$f":"+$C$80+$H$80","v":{"$error":"#REF!"}},{"$f":"+$C$78+$H$78","v":{"$error":"#REF!"}},{"$f":"+$C$76+$C$84","v":{"$error":"#REF!"}},{"$f":"D482-E482-F482-G482-H482","v":{"$error":"#REF!"}},{"$error":"#REF!"},{"$error":"#REF!"},{"$error":"#REF!"},{"$error":"#REF!"},{"$f":"M482-K482","v":{"$error":"#REF!"}}]
[null,null,"00:00:00",{"$error":"#REF!"},{"$f":"+$C$82+$H$82","v":{"$error":"#REF!"}},{"$error":"#REF!"},{"$error":"#REF!"},{"$error":"#REF!"},{"$error":"#REF!"},{"$error":"#REF!"},{"$error":"#REF!"},{"$f":"M482+I483","v":{"$error":"#REF!"}},{"$f":"L483*(1+$C$44)","v":{"$error":"#REF!"}},{"$error":"#REF!"}]
[null,null,"00:00:00",{"$error":"#REF!"},{"$error":"#REF!"},{"$error":"#REF!"},{"$error":"#REF!"},{"$error":"#REF!"},{"$error":"#REF!"},{"$f":"+K483+I484","v":{"$error":"#REF!"}},{"$error":"#REF!"},{"$error":"#REF!"},{"$error":"#REF!"},{"$error":"#REF!"}]
[null,null,"00:00:00",{"$error":"#REF!"},{"$error":"#REF!"},{"$error":"#REF!"},{"$error":"#REF!"},{"$error":"#REF!"},{"$error":"#REF!"},{"$error":"#REF!"},{"$f":"+(1+$C$42)*J485","v":{"$error":"#REF!"}},{"$error":"#REF!"},{"$error":"#REF!"},{"$error":"#REF!"}]
[null,null,"00:00:00",{"$error":"#REF!"},{"$error":"#REF!"},{"$error":"#REF!"},{"$error":"#REF!"},{"$error":"#REF!"},{"$error":"#REF!"},{"$error":"#REF!"},{"$error":"#REF!"},{"$error":"#REF!"},{"$error":"#REF!"},{"$error":"#REF!"}]
[null,null,"00:00:00",{"$error":"#REF!"},{"$error":"#REF!"},{"$error":"#REF!"},{"$error":"#REF!"},{"$error":"#REF!"},{"$error":"#REF!"},{"$error":"#REF!"},{"$error":"#REF!"},{"$error":"#REF!"},{"$error":"#REF!"},{"$error":"#REF!"}]
[null,null,"00:00:00",{"$error":"#REF!"},{"$error":"#REF!"},{"$error":"#REF!"},{"$error":"#REF!"},{"$error":"#REF!"},{"$error":"#REF!"},{"$error":"#REF!"},{"$error":"#REF!"},{"$error":"#REF!"},{"$error":"#REF!"},{"$error":"#REF!"}]
[null,null,"00:00:00",{"$error":"#REF!"},{"$error":"#REF!"},{"$error":"#REF!"},{"$error":"#REF!"},{"$error":"#REF!"},{"$error":"#REF!"},{"$error":"#REF!"},{"$error":"#REF!"},{"$error":"#REF!"},{"$error":"#REF!"},{"$error":"#REF!"}]
[null,null,"00:00:00",{"$error":"#REF!"},{"$error":"#REF!"},{"$error":"#REF!"},{"$error":"#REF!"},{"$error":"#REF!"},{"$error":"#REF!"},{"$error":"#REF!"},{"$error":"#REF!"},{"$error":"#REF!"},{"$error":"#REF!"},{"$error":"#REF!"}]
[null,null,"00:00:00",{"$error":"#REF!"},{"$error":"#REF!"},{"$error":"#REF!"},{"$error":"#REF!"},{"$error":"#REF!"},{"$error":"#REF!"},{"$error":"#REF!"},{"$error":"#REF!"},{"$error":"#REF!"},{"$error":"#REF!"},{"$error":"#REF!"}]
[null,null,"00:00:00",{"$error":"#REF!"},{"$error":"#REF!"},{"$error":"#REF!"},{"$error":"#REF!"},{"$error":"#REF!"},{"$error":"#REF!"},{"$error":"#REF!"},{"$error":"#REF!"},{"$error":"#REF!"},{"$error":"#REF!"},{"$error":"#REF!"}]
[null,null,"00:00:00",{"$error":"#REF!"},{"$error":"#REF!"},{"$error":"#REF!"},{"$error":"#REF!"},{"$error":"#REF!"},{"$error":"#REF!"},{"$error":"#REF!"},{"$error":"#REF!"},{"$error":"#REF!"},{"$error":"#REF!"},{"$error":"#REF!"}]
[null,null,"00:00:00",{"$error":"#REF!"},{"$error":"#REF!"},{"$error":"#REF!"},{"$error":"#REF!"},{"$error":"#REF!"},{"$error":"#REF!"},{"$error":"#REF!"},{"$error":"#REF!"},{"$error":"#REF!"},{"$error":"#REF!"},{"$error":"#REF!"}]
[null,null,"00:00:00",{"$error":"#REF!"},{"$error":"#REF!"},{"$error":"#REF!"},{"$error":"#REF!"},{"$error":"#REF!"},{"$error":"#REF!"},{"$error":"#REF!"},{"$error":"#REF!"},{"$error":"#REF!"},{"$error":"#REF!"},{"$error":"#REF!"}]
[null,null,"00:00:00",{"$error":"#REF!"},{"$error":"#REF!"},{"$error":"#REF!"},{"$error":"#REF!"},{"$error":"#REF!"},{"$error":"#REF!"},{"$error":"#REF!"},{"$error":"#REF!"},{"$error":"#REF!"},{"$error":"#REF!"},{"$error":"#REF!"}]
[null,null,"00:00:00",{"$error":"#REF!"},{"$error":"#REF!"},{"$error":"#REF!"},{"$error":"#REF!"},{"$error":"#REF!"},{"$error":"#REF!"},{"$error":"#REF!"},{"$error":"#REF!"},{"$error":"#REF!"},{"$error":"#REF!"},{"$error":"#REF!"}]
[null,null,"00:00:00",{"$error":"#REF!"},{"$error":"#REF!"},{"$error":"#REF!"},{"$error":"#REF!"},{"$error":"#REF!"},{"$error":"#REF!"},{"$error":"#REF!"},{"$error":"#REF!"},{"$error":"#REF!"},{"$error":"#REF!"},{"$error":"#REF!"}]
[null,null,"00:00:00",{"$error":"#REF!"},{"$error":"#REF!"},{"$error":"#REF!"},{"$error":"#REF!"},{"$error":"#REF!"},{"$error":"#REF!"},{"$error":"#REF!"},{"$error":"#REF!"},{"$error":"#REF!"},{"$error":"#REF!"},{"$error":"#REF!"}]
[null,null,"00:00:00",{"$error":"#REF!"},{"$error":"#REF!"},{"$error":"#REF!"},{"$error":"#REF!"},{"$error":"#REF!"},{"$error":"#REF!"},{"$error":"#REF!"},{"$error":"#REF!"},{"$error":"#REF!"},{"$error":"#REF!"},{"$error":"#REF!"}]
[null,null,"00:00:00",{"$error":"#REF!"},{"$error":"#REF!"},{"$error":"#REF!"},{"$error":"#REF!"},{"$error":"#REF!"},{"$error":"#REF!"},{"$error":"#REF!"},{"$error":"#REF!"},{"$error":"#REF!"},{"$error":"#REF!"},{"$error":"#REF!"}]
[null,null,"00:00:00",{"$error":"#REF!"},{"$error":"#REF!"},{"$error":"#REF!"},{"$error":"#REF!"},{"$error":"#REF!"},{"$error":"#REF!"},{"$error":"#REF!"},{"$error":"#REF!"},{"$error":"#REF!"},{"$error":"#REF!"},{"$error":"#REF!"}]
[null,null,"00:00:00",{"$error":"#REF!"},{"$error":"#REF!"},{"$error":"#REF!"},{"$error":"#REF!"},{"$error":"#REF!"},{"$error":"#REF!"},{"$error":"#REF!"},{"$error":"#REF!"},{"$error":"#REF!"},{"$error":"#REF!"},{"$error":"#REF!"}]
[null,null,"00:00:00",{"$error":"#REF!"},{"$error":"#REF!"},{"$error":"#REF!"},{"$error":"#REF!"},{"$error":"#REF!"},{"$error":"#REF!"},{"$error":"#REF!"},{"$error":"#REF!"},{"$error":"#REF!"},{"$error":"#REF!"},{"$error":"#REF!"}]
[null,null,"00:00:00",{"$error":"#REF!"},{"$error":"#REF!"},{"$error":"#REF!"},{"$error":"#REF!"},{"$error":"#REF!"},{"$error":"#REF!"},{"$error":"#REF!"},{"$error":"#REF!"},{"$error":"#REF!"},{"$error":"#REF!"},{"$error":"#REF!"}]
[null,null,"00:00:00",{"$error":"#REF!"},{"$error":"#REF!"},{"$error":"#REF!"},{"$error":"#REF!"},{"$error":"#REF!"},{"$error":"#REF!"},{"$error":"#REF!"},{"$error":"#REF!"},{"$error":"#REF!"},{"$error":"#REF!"},{"$error":"#REF!"}]
[null,null,"00:00:00",{"$error":"#REF!"},{"$error":"#REF!"},{"$error":"#REF!"},{"$error":"#REF!"},{"$error":"#REF!"},{"$error":"#REF!"},{"$error":"#REF!"},{"$error":"#REF!"},{"$error":"#REF!"},{"$error":"#REF!"},{"$error":"#REF!"}]
[null,null,"00:00:00",{"$error":"#REF!"},{"$error":"#REF!"},{"$error":"#REF!"},{"$error":"#REF!"},{"$error":"#REF!"},{"$error":"#REF!"},{"$error":"#REF!"},{"$error":"#REF!"},{"$error":"#REF!"},{"$error":"#REF!"},{"$error":"#REF!"}]
[null,null,"00:00:00",{"$error":"#REF!"},{"$error":"#REF!"},{"$error":"#REF!"},{"$error":"#REF!"},{"$error":"#REF!"},{"$error":"#REF!"},{"$error":"#REF!"},{"$error":"#REF!"},{"$error":"#REF!"},{"$error":"#REF!"},{"$error":"#REF!"}]
[null,null,"00:00:00",{"$error":"#REF!"},{"$error":"#REF!"},{"$error":"#REF!"},{"$error":"#REF!"},{"$error":"#REF!"},{"$error":"#REF!"},{"$error":"#REF!"},{"$error":"#REF!"},{"$error":"#REF!"},{"$error":"#REF!"},{"$error":"#REF!"}]
[null,null,"00:00:00",{"$error":"#REF!"},{"$error":"#REF!"},{"$error":"#REF!"},{"$error":"#REF!"},{"$error":"#REF!"},{"$error":"#REF!"},{"$error":"#REF!"},{"$error":"#REF!"},{"$error":"#REF!"},{"$error":"#REF!"},{"$error":"#REF!"}]
[null,null,"00:00:00",{"$error":"#REF!"},{"$error":"#REF!"},{"$error":"#REF!"},{"$error":"#REF!"},{"$error":"#REF!"},{"$error":"#REF!"},{"$error":"#REF!"},{"$error":"#REF!"},{"$error":"#REF!"},{"$error":"#REF!"},{"$error":"#REF!"}]
[null,null,"00:00:00",{"$error":"#REF!"},{"$error":"#REF!"},{"$error":"#REF!"},{"$error":"#REF!"},{"$error":"#REF!"},{"$error":"#REF!"},{"$error":"#REF!"},{"$error":"#REF!"},{"$error":"#REF!"},{"$error":"#REF!"},{"$error":"#REF!"}]
[null,null,"00:00:00",{"$error":"#REF!"},{"$error":"#REF!"},{"$error":"#REF!"},{"$error":"#REF!"},{"$error":"#REF!"},{"$error":"#REF!"},{"$error":"#REF!"},{"$error":"#REF!"},{"$error":"#REF!"},{"$error":"#REF!"},{"$error":"#REF!"}]
[null,null,"00:00:00",{"$error":"#REF!"},{"$error":"#REF!"},{"$error":"#REF!"},{"$error":"#REF!"},{"$error":"#REF!"},{"$error":"#REF!"},{"$error":"#REF!"},{"$error":"#REF!"},{"$error":"#REF!"},{"$error":"#REF!"},{"$error":"#REF!"}]
[null,null,"00:00:00",{"$error":"#REF!"},{"$error":"#REF!"},{"$error":"#REF!"},{"$error":"#REF!"},{"$error":"#REF!"},{"$error":"#REF!"},{"$error":"#REF!"},{"$error":"#REF!"},{"$error":"#REF!"},{"$error":"#REF!"},{"$error":"#REF!"}]
[null,null,"00:00:00",{"$error":"#REF!"},{"$error":"#REF!"},{"$error":"#REF!"},{"$error":"#REF!"},{"$error":"#REF!"},{"$error":"#REF!"},{"$error":"#REF!"},{"$error":"#REF!"},{"$error":"#REF!"},{"$error":"#REF!"},{"$error":"#REF!"}]
[null,null,"00:00:00",{"$error":"#REF!"},{"$error":"#REF!"},{"$error":"#REF!"},{"$error":"#REF!"},{"$error":"#REF!"},{"$error":"#REF!"},{"$error":"#REF!"},{"$error":"#REF!"},{"$error":"#REF!"},{"$error":"#REF!"},{"$error":"#REF!"}]
[null,null,"00:00:00",{"$error":"#REF!"},{"$error":"#REF!"},{"$error":"#REF!"},{"$error":"#REF!"},{"$error":"#REF!"},{"$error":"#REF!"},{"$error":"#REF!"},{"$error":"#REF!"},{"$error":"#REF!"},{"$error":"#REF!"},{"$error":"#REF!"}]
[null,null,"00:00:00",{"$error":"#REF!"},{"$error":"#REF!"},{"$error":"#REF!"},{"$error":"#REF!"},{"$error":"#REF!"},{"$error":"#REF!"},{"$error":"#REF!"},{"$error":"#REF!"},{"$error":"#REF!"},{"$error":"#REF!"},{"$error":"#REF!"}]
[null,null,"00:00:00",{"$error":"#REF!"},{"$error":"#REF!"},{"$error":"#REF!"},{"$error":"#REF!"},{"$error":"#REF!"},{"$error":"#REF!"},{"$error":"#REF!"},{"$error":"#REF!"},{"$error":"#REF!"},{"$error":"#REF!"},{"$error":"#REF!"}]
[null,null,"00:00:00",{"$error":"#REF!"},{"$error":"#REF!"},{"$error":"#REF!"},{"$error":"#REF!"},{"$error":"#REF!"},{"$error":"#REF!"},{"$error":"#REF!"},{"$error":"#REF!"},{"$error":"#REF!"},{"$error":"#REF!"},{"$error":"#REF!"}]
[null,null,"00:00:00",{"$error":"#REF!"},{"$error":"#REF!"},{"$error":"#REF!"},{"$error":"#REF!"},{"$error":"#REF!"},{"$error":"#REF!"},{"$error":"#REF!"},{"$error":"#REF!"},{"$error":"#REF!"},{"$error":"#REF!"},{"$error":"#REF!"}]
[null,null,"00:00:00",{"$error":"#REF!"},{"$error":"#REF!"},{"$error":"#REF!"},{"$error":"#REF!"},{"$error":"#REF!"},{"$error":"#REF!"},{"$error":"#REF!"},{"$error":"#REF!"},{"$error":"#REF!"},{"$error":"#REF!"},{"$error":"#REF!"}]
[null,null,"00:00:00",{"$error":"#REF!"},{"$error":"#REF!"},{"$error":"#REF!"},{"$error":"#REF!"},{"$error":"#REF!"},{"$error":"#REF!"},{"$error":"#REF!"},{"$error":"#REF!"},{"$error":"#REF!"},{"$error":"#REF!"},{"$error":"#REF!"}]
[null,null,"00:00:00",{"$error":"#REF!"},{"$error":"#REF!"},{"$error":"#REF!"},{"$error":"#REF!"},{"$error":"#REF!"},{"$error":"#REF!"},{"$error":"#REF!"},{"$error":"#REF!"},{"$error":"#REF!"},{"$error":"#REF!"},{"$error":"#REF!"}]
[null,null,"00:00:00",{"$error":"#REF!"},{"$error":"#REF!"},{"$error":"#REF!"},{"$error":"#REF!"},{"$error":"#REF!"},{"$error":"#REF!"},{"$error":"#REF!"},{"$error":"#REF!"},{"$error":"#REF!"},{"$error":"#REF!"},{"$error":"#REF!"}]
[null,null,"00:00:00",{"$error":"#REF!"},{"$error":"#REF!"},{"$error":"#REF!"},{"$error":"#REF!"},{"$error":"#REF!"},{"$error":"#REF!"},{"$error":"#REF!"},{"$error":"#REF!"},{"$error":"#REF!"},{"$error":"#REF!"},{"$error":"#REF!"}]
[null,null,"00:00:00",{"$error":"#REF!"},{"$error":"#REF!"},{"$error":"#REF!"},{"$error":"#REF!"},{"$error":"#REF!"},{"$error":"#REF!"},{"$error":"#REF!"},{"$error":"#REF!"},{"$error":"#REF!"},{"$error":"#REF!"},{"$error":"#REF!"}]
[null,null,"00:00:00",{"$error":"#REF!"},{"$error":"#REF!"},{"$error":"#REF!"},{"$error":"#REF!"},{"$error":"#REF!"},{"$error":"#REF!"},{"$error":"#REF!"},{"$error":"#REF!"},{"$error":"#REF!"},{"$error":"#REF!"},{"$error":"#REF!"}]
[null,null,"00:00:00",{"$error":"#REF!"},{"$error":"#REF!"},{"$error":"#REF!"},{"$error":"#REF!"},{"$error":"#REF!"},{"$error":"#REF!"},{"$error":"#REF!"},{"$error":"#REF!"},{"$error":"#REF!"},{"$error":"#REF!"},{"$error":"#REF!"}]
[null,null,"00:00:00",{"$error":"#REF!"},{"$error":"#REF!"},{"$error":"#REF!"},{"$error":"#REF!"},{"$error":"#REF!"},{"$error":"#REF!"},{"$error":"#REF!"},{"$error":"#REF!"},{"$error":"#REF!"},{"$error":"#REF!"},{"$error":"#REF!"}]
[null,null,"00:00:00",{"$error":"#REF!"},{"$error":"#REF!"},{"$error":"#REF!"},{"$error":"#REF!"},{"$error":"#REF!"},{"$error":"#REF!"},{"$error":"#REF!"},{"$error":"#REF!"},{"$error":"#REF!"},{"$error":"#REF!"},{"$error":"#REF!"}]
[null,null,"00:00:00",{"$error":"#REF!"},{"$error":"#REF!"},{"$error":"#REF!"},{"$error":"#REF!"},{"$error":"#REF!"},{"$error":"#REF!"},{"$error":"#REF!"},{"$error":"#REF!"},{"$error":"#REF!"},{"$error":"#REF!"},{"$error":"#REF!"}]
[null,null,"00:00:00",{"$error":"#REF!"},{"$error":"#REF!"},{"$error":"#REF!"},{"$error":"#REF!"},{"$error":"#REF!"},{"$error":"#REF!"},{"$error":"#REF!"},{"$error":"#REF!"},{"$error":"#REF!"},{"$error":"#REF!"},{"$error":"#REF!"}]
[null,null,"00:00:00",{"$error":"#REF!"},{"$error":"#REF!"},{"$error":"#REF!"},{"$error":"#REF!"},{"$error":"#REF!"},{"$error":"#REF!"},{"$error":"#REF!"},{"$error":"#REF!"},{"$error":"#REF!"},{"$error":"#REF!"},{"$error":"#REF!"}]
[null,null,"00:00:00",{"$error":"#REF!"},{"$error":"#REF!"},{"$error":"#REF!"},{"$error":"#REF!"},{"$error":"#REF!"},{"$error":"#REF!"},{"$error":"#REF!"},{"$error":"#REF!"},{"$error":"#REF!"},{"$error":"#REF!"},{"$error":"#REF!"}]
[null,null,"00:00:00",{"$error":"#REF!"},{"$error":"#REF!"},{"$error":"#REF!"},{"$error":"#REF!"},{"$error":"#REF!"},{"$error":"#REF!"},{"$error":"#REF!"},{"$error":"#REF!"},{"$error":"#REF!"},{"$error":"#REF!"},{"$error":"#REF!"}]
[null,null,"00:00:00",{"$error":"#REF!"},{"$error":"#REF!"},{"$error":"#REF!"},{"$error":"#REF!"},{"$error":"#REF!"},{"$error":"#REF!"},{"$error":"#REF!"},{"$error":"#REF!"},{"$error":"#REF!"},{"$error":"#REF!"},{"$error":"#REF!"}]
[null,null,"00:00:00",{"$error":"#REF!"},{"$error":"#REF!"},{"$error":"#REF!"},{"$error":"#REF!"},{"$error":"#REF!"},{"$error":"#REF!"},{"$error":"#REF!"},{"$error":"#REF!"},{"$error":"#REF!"},{"$error":"#REF!"},{"$error":"#REF!"}]
[null,null,"00:00:00",{"$error":"#REF!"},{"$error":"#REF!"},{"$error":"#REF!"},{"$error":"#REF!"},{"$error":"#REF!"},{"$error":"#REF!"},{"$error":"#REF!"},{"$error":"#REF!"},{"$error":"#REF!"},{"$error":"#REF!"},{"$error":"#REF!"}]
[null,null,"00:00:00",{"$error":"#REF!"},{"$error":"#REF!"},{"$error":"#REF!"},{"$error":"#REF!"},{"$error":"#REF!"},{"$error":"#REF!"},{"$error":"#REF!"},{"$error":"#REF!"},{"$error":"#REF!"},{"$error":"#REF!"},{"$error":"#REF!"}]
[null,null,"00:00:00",{"$error":"#REF!"},{"$error":"#REF!"},{"$error":"#REF!"},{"$error":"#REF!"},{"$error":"#REF!"},{"$error":"#REF!"},{"$error":"#REF!"},{"$error":"#REF!"},{"$error":"#REF!"},{"$error":"#REF!"},{"$error":"#REF!"}]
[null,null,"00:00:00",{"$error":"#REF!"},{"$error":"#REF!"},{"$error":"#REF!"},{"$error":"#REF!"},{"$error":"#REF!"},{"$error":"#REF!"},{"$error":"#REF!"},{"$error":"#REF!"},{"$error":"#REF!"},{"$error":"#REF!"},{"$error":"#REF!"}]
[null,null,"00:00:00",{"$f":"$G$49","v":{"$error":"#REF!"}},{"$error":"#REF!"},{"$error":"#REF!"},{"$error":"#REF!"},{"$error":"#REF!"},{"$error":"#REF!"},{"$error":"#REF!"},{"$error":"#REF!"},{"$error":"#REF!"},{"$error":"#REF!"},{"$error":"#REF!"}]
[null,null,{"$f":"B546","v":"00:00:00"},{"$error":"#REF!"},{"$error":"#REF!"},{"$f":"+$C$80+$H$80","v":{"$error":"#REF!"}},{"$f":"+$C$78+$H$78","v":{"$error":"#REF!"}},{"$f":"+$C$76+$C$84","v":{"$error":"#REF!"}},{"$f":"D546-E546-F546-G546-H546","v":{"$error":"#REF!"}},{"$error":"#REF!"},{"$error":"#REF!"},{"$error":"#REF!"},{"$error":"#REF!"},{"$f":"M546-K546","v":{"$error":"#REF!"}}]
[null,null,"00:00:00",{"$error":"#REF!"},{"$f":"+$C$82+$H$82","v":{"$error":"#REF!"}},{"$error":"#REF!"},{"$error":"#REF!"},{"$error":"#REF!"},{"$error":"#REF!"},{"$error":"#REF!"},{"$error":"#REF!"},{"$f":"M546+I547","v":{"$error":"#REF!"}},{"$f":"L547*(1+$C$44)","v":{"$error":"#REF!"}},{"$error":"#REF!"}]
[null,null,"00:00:00",{"$error":"#REF!"},{"$error":"#REF!"},{"$error":"#REF!"},{"$error":"#REF!"},{"$error":"#REF!"},{"$error":"#REF!"},{"$f":"+K547+I548","v":{"$error":"#REF!"}},{"$error":"#REF!"},{"$error":"#REF!"},{"$error":"#REF!"},{"$error":"#REF!"}]
[null,null,"00:00:00",{"$error":"#REF!"},{"$error":"#REF!"},{"$error":"#REF!"},{"$error":"#REF!"},{"$error":"#REF!"},{"$error":"#REF!"},{"$error":"#REF!"},{"$f":"+(1+$C$42)*J549","v":{"$error":"#REF!"}},{"$error":"#REF!"},{"$error":"#REF!"},{"$error":"#REF!"}]
[null,null,"00:00:00",{"$error":"#REF!"},{"$error":"#REF!"},{"$error":"#REF!"},{"$error":"#REF!"},{"$error":"#REF!"},{"$error":"#REF!"},{"$error":"#REF!"},{"$error":"#REF!"},{"$error":"#REF!"},{"$error":"#REF!"},{"$error":"#REF!"}]
[null,null,"00:00:00",{"$error":"#REF!"},{"$error":"#REF!"},{"$error":"#REF!"},{"$error":"#REF!"},{"$error":"#REF!"},{"$error":"#REF!"},{"$error":"#REF!"},{"$error":"#REF!"},{"$error":"#REF!"},{"$error":"#REF!"},{"$error":"#REF!"}]
[null,null,"00:00:00",{"$error":"#REF!"},{"$error":"#REF!"},{"$error":"#REF!"},{"$error":"#REF!"},{"$error":"#REF!"},{"$error":"#REF!"},{"$error":"#REF!"},{"$error":"#REF!"},{"$error":"#REF!"},{"$error":"#REF!"},{"$error":"#REF!"}]
[null,null,"00:00:00",{"$error":"#REF!"},{"$error":"#REF!"},{"$error":"#REF!"},{"$error":"#REF!"},{"$error":"#REF!"},{"$error":"#REF!"},{"$error":"#REF!"},{"$error":"#REF!"},{"$error":"#REF!"},{"$error":"#REF!"},{"$error":"#REF!"}]
[null,null,"00:00:00",{"$error":"#REF!"},{"$error":"#REF!"},{"$error":"#REF!"},{"$error":"#REF!"},{"$error":"#REF!"},{"$error":"#REF!"},{"$error":"#REF!"},{"$error":"#REF!"},{"$error":"#REF!"},{"$error":"#REF!"},{"$error":"#REF!"}]
[null,null,"00:00:00",{"$error":"#REF!"},{"$error":"#REF!"},{"$error":"#REF!"},{"$error":"#REF!"},{"$error":"#REF!"},{"$error":"#REF!"},{"$error":"#REF!"},{"$error":"#REF!"},{"$error":"#REF!"},{"$error":"#REF!"},{"$error":"#REF!"}]
[null,null,"00:00:00",{"$error":"#REF!"},{"$error":"#REF!"},{"$error":"#REF!"},{"$error":"#REF!"},{"$error":"#REF!"},{"$error":"#REF!"},{"$error":"#REF!"},{"$error":"#REF!"},{"$error":"#REF!"},{"$error":"#REF!"},{"$error":"#REF!"}]
[null,null,"00:00:00",{"$error":"#REF!"},{"$error":"#REF!"},{"$error":"#REF!"},{"$error":"#REF!"},{"$error":"#REF!"},{"$error":"#REF!"},{"$error":"#REF!"},{"$error":"#REF!"},{"$error":"#REF!"},{"$error":"#REF!"},{"$error":"#REF!"}]
[null,null,"00:00:00",{"$error":"#REF!"},{"$error":"#REF!"},{"$error":"#REF!"},{"$error":"#REF!"},{"$error":"#REF!"},{"$error":"#REF!"},{"$error":"#REF!"},{"$error":"#REF!"},{"$error":"#REF!"},{"$error":"#REF!"},{"$error":"#REF!"}]
[null,null,"00:00:00",{"$error":"#REF!"},{"$error":"#REF!"},{"$error":"#REF!"},{"$error":"#REF!"},{"$error":"#REF!"},{"$error":"#REF!"},{"$error":"#REF!"},{"$error":"#REF!"},{"$error":"#REF!"},{"$error":"#REF!"},{"$error":"#REF!"}]
[null,null,"00:00:00",{"$error":"#REF!"},{"$error":"#REF!"},{"$error":"#REF!"},{"$error":"#REF!"},{"$error":"#REF!"},{"$error":"#REF!"},{"$error":"#REF!"},{"$error":"#REF!"},{"$error":"#REF!"},{"$error":"#REF!"},{"$error":"#REF!"}]
[null,null,"00:00:00",{"$error":"#REF!"},{"$error":"#REF!"},{"$error":"#REF!"},{"$error":"#REF!"},{"$error":"#REF!"},{"$error":"#REF!"},{"$error":"#REF!"},{"$error":"#REF!"},{"$error":"#REF!"},{"$error":"#REF!"},{"$error":"#REF!"}]
[null,null,"00:00:00",{"$error":"#REF!"},{"$error":"#REF!"},{"$error":"#REF!"},{"$error":"#REF!"},{"$error":"#REF!"},{"$error":"#REF!"},{"$error":"#REF!"},{"$error":"#REF!"},{"$error":"#REF!"},{"$error":"#REF!"},{"$error":"#REF!"}]
[null,null,"00:00:00",{"$error":"#REF!"},{"$error":"#REF!"},{"$error":"#REF!"},{"$error":"#REF!"},{"$error":"#REF!"},{"$error":"#REF!"},{"$error":"#REF!"},{"$error":"#REF!"},{"$error":"#REF!"},{"$error":"#REF!"},{"$error":"#REF!"}]
[null,null,"00:00:00",{"$error":"#REF!"},{"$error":"#REF!"},{"$error":"#REF!"},{"$error":"#REF!"},{"$error":"#REF!"},{"$error":"#REF!"},{"$error":"#REF!"},{"$error":"#REF!"},{"$error":"#REF!"},{"$error":"#REF!"},{"$error":"#REF!"}]
[null,null,"00:00:00",{"$error":"#REF!"},{"$error":"#REF!"},{"$error":"#REF!"},{"$error":"#REF!"},{"$error":"#REF!"},{"$error":"#REF!"},{"$error":"#REF!"},{"$error":"#REF!"},{"$error":"#REF!"},{"$error":"#REF!"},{"$error":"#REF!"}]
[null,null,"00:00:00",{"$error":"#REF!"},{"$error":"#REF!"},{"$error":"#REF!"},{"$error":"#REF!"},{"$error":"#REF!"},{"$error":"#REF!"},{"$error":"#REF!"},{"$error":"#REF!"},{"$error":"#REF!"},{"$error":"#REF!"},{"$error":"#REF!"}]
[null,null,"00:00:00",{"$error":"#REF!"},{"$error":"#REF!"},{"$error":"#REF!"},{"$error":"#REF!"},{"$error":"#REF!"},{"$error":"#REF!"},{"$error":"#REF!"},{"$error":"#REF!"},{"$error":"#REF!"},{"$error":"#REF!"},{"$error":"#REF!"}]
[null,null,"00:00:00",{"$error":"#REF!"},{"$error":"#REF!"},{"$error":"#REF!"},{"$error":"#REF!"},{"$error":"#REF!"},{"$error":"#REF!"},{"$error":"#REF!"},{"$error":"#REF!"},{"$error":"#REF!"},{"$error":"#REF!"},{"$error":"#REF!"}]
[null,null,"00:00:00",{"$error":"#REF!"},{"$error":"#REF!"},{"$error":"#REF!"},{"$error":"#REF!"},{"$error":"#REF!"},{"$error":"#REF!"},{"$error":"#REF!"},{"$error":"#REF!"},{"$error":"#REF!"},{"$error":"#REF!"},{"$error":"#REF!"}]
[null,null,"00:00:00",{"$error":"#REF!"},{"$error":"#REF!"},{"$error":"#REF!"},{"$error":"#REF!"},{"$error":"#REF!"},{"$error":"#REF!"},{"$error":"#REF!"},{"$error":"#REF!"},{"$error":"#REF!"},{"$error":"#REF!"},{"$error":"#REF!"}]
[null,null,"00:00:00",{"$error":"#REF!"},{"$error":"#REF!"},{"$error":"#REF!"},{"$error":"#REF!"},{"$error":"#REF!"},{"$error":"#REF!"},{"$error":"#REF!"},{"$error":"#REF!"},{"$error":"#REF!"},{"$error":"#REF!"},{"$error":"#REF!"}]
[null,null,"00:00:00",{"$error":"#REF!"},{"$error":"#REF!"},{"$error":"#REF!"},{"$error":"#REF!"},{"$error":"#REF!"},{"$error":"#REF!"},{"$error":"#REF!"},{"$error":"#REF!"},{"$error":"#REF!"},{"$error":"#REF!"},{"$error":"#REF!"}]
[null,null,"00:00:00",{"$error":"#REF!"},{"$error":"#REF!"},{"$error":"#REF!"},{"$error":"#REF!"},{"$error":"#REF!"},{"$error":"#REF!"},{"$error":"#REF!"},{"$error":"#REF!"},{"$error":"#REF!"},{"$error":"#REF!"},{"$error":"#REF!"}]
[null,null,"00:00:00",{"$error":"#REF!"},{"$error":"#REF!"},{"$error":"#REF!"},{"$error":"#REF!"},{"$error":"#REF!"},{"$error":"#REF!"},{"$error":"#REF!"},{"$error":"#REF!"},{"$error":"#REF!"},{"$error":"#REF!"},{"$error":"#REF!"}]
[null,null,"00:00:00",{"$error":"#REF!"},{"$error":"#REF!"},{"$error":"#REF!"},{"$error":"#REF!"},{"$error":"#REF!"},{"$error":"#REF!"},{"$error":"#REF!"},{"$error":"#REF!"},{"$error":"#REF!"},{"$error":"#REF!"},{"$error":"#REF!"}]
[null,null,"00:00:00",{"$error":"#REF!"},{"$error":"#REF!"},{"$error":"#REF!"},{"$error":"#REF!"},{"$error":"#REF!"},{"$error":"#REF!"},{"$error":"#REF!"},{"$error":"#REF!"},{"$error":"#REF!"},{"$error":"#REF!"},{"$error":"#REF!"}]
[null,null,"00:00:00",{"$error":"#REF!"},{"$error":"#REF!"},{"$error":"#REF!"},{"$error":"#REF!"},{"$error":"#REF!"},{"$error":"#REF!"},{"$error":"#REF!"},{"$error":"#REF!"},{"$error":"#REF!"},{"$error":"#REF!"},{"$error":"#REF!"}]
[null,null,"00:00:00",{"$error":"#REF!"},{"$error":"#REF!"},{"$error":"#REF!"},{"$error":"#REF!"},{"$error":"#REF!"},{"$error":"#REF!"},{"$error":"#REF!"},{"$error":"#REF!"},{"$error":"#REF!"},{"$error":"#REF!"},{"$error":"#REF!"}]
[null,null,"00:00:00",{"$error":"#REF!"},{"$error":"#REF!"},{"$error":"#REF!"},{"$error":"#REF!"},{"$error":"#REF!"},{"$error":"#REF!"},{"$error":"#REF!"},{"$error":"#REF!"},{"$error":"#REF!"},{"$error":"#REF!"},{"$error":"#REF!"}]
[null,null,"00:00:00",{"$error":"#REF!"},{"$error":"#REF!"},{"$error":"#REF!"},{"$error":"#REF!"},{"$error":"#REF!"},{"$error":"#REF!"},{"$error":"#REF!"},{"$error":"#REF!"},{"$error":"#REF!"},{"$error":"#REF!"},{"$error":"#REF!"}]
[null,null,"00:00:00",{"$error":"#REF!"},{"$error":"#REF!"},{"$error":"#REF!"},{"$error":"#REF!"},{"$error":"#REF!"},{"$error":"#REF!"},{"$error":"#REF!"},{"$error":"#REF!"},{"$error":"#REF!"},{"$error":"#REF!"},{"$error":"#REF!"}]
[null,null,"00:00:00",{"$error":"#REF!"},{"$error":"#REF!"},{"$error":"#REF!"},{"$error":"#REF!"},{"$error":"#REF!"},{"$error":"#REF!"},{"$error":"#REF!"},{"$error":"#REF!"},{"$error":"#REF!"},{"$error":"#REF!"},{"$error":"#REF!"}]
[null,null,"00:00:00",{"$error":"#REF!"},{"$error":"#REF!"},{"$error":"#REF!"},{"$error":"#REF!"},{"$error":"#REF!"},{"$error":"#REF!"},{"$error":"#REF!"},{"$error":"#REF!"},{"$error":"#REF!"},{"$error":"#REF!"},{"$error":"#REF!"}]
[null,null,"00:00:00",{"$error":"#REF!"},{"$error":"#REF!"},{"$error":"#REF!"},{"$error":"#REF!"},{"$error":"#REF!"},{"$error":"#REF!"},{"$error":"#REF!"},{"$error":"#REF!"},{"$error":"#REF!"},{"$error":"#REF!"},{"$error":"#REF!"}]
[null,null,"00:00:00",{"$error":"#REF!"},{"$error":"#REF!"},{"$error":"#REF!"},{"$error":"#REF!"},{"$error":"#REF!"},{"$error":"#REF!"},{"$error":"#REF!"},{"$error":"#REF!"},{"$error":"#REF!"},{"$error":"#REF!"},{"$error":"#REF!"}]
[null,null,"00:00:00",{"$error":"#REF!"},{"$error":"#REF!"},{"$error":"#REF!"},{"$error":"#REF!"},{"$error":"#REF!"},{"$error":"#REF!"},{"$error":"#REF!"},{"$error":"#REF!"},{"$error":"#REF!"},{"$error":"#REF!"},{"$error":"#REF!"}]
[null,null,"00:00:00",{"$error":"#REF!"},{"$error":"#REF!"},{"$error":"#REF!"},{"$error":"#REF!"},{"$error":"#REF!"},{"$error":"#REF!"},{"$error":"#REF!"},{"$error":"#REF!"},{"$error":"#REF!"},{"$error":"#REF!"},{"$error":"#REF!"}]
[null,null,"00:00:00",{"$error":"#REF!"},{"$error":"#REF!"},{"$error":"#REF!"},{"$error":"#REF!"},{"$error":"#REF!"},{"$error":"#REF!"},{"$error":"#REF!"},{"$error":"#REF!"},{"$error":"#REF!"},{"$error":"#REF!"},{"$error":"#REF!"}]
[null,null,"00:00:00",{"$error":"#REF!"},{"$error":"#REF!"},{"$error":"#REF!"},{"$error":"#REF!"},{"$error":"#REF!"},{"$error":"#REF!"},{"$error":"#REF!"},{"$error":"#REF!"},{"$error":"#REF!"},{"$error":"#REF!"},{"$error":"#REF!"}]
[null,null,"00:00:00",{"$error":"#REF!"},{"$error":"#REF!"},{"$error":"#REF!"},{"$error":"#REF!"},{"$error":"#REF!"},{"$error":"#REF!"},{"$error":"#REF!"},{"$error":"#REF!"},{"$error":"#REF!"},{"$error":"#REF!"},{"$error":"#REF!"}]
[null,null,"00:00:00",{"$error":"#REF!"},{"$error":"#REF!"},{"$error":"#REF!"},{"$error":"#REF!"},{"$error":"#REF!"},{"$error":"#REF!"},{"$error":"#REF!"},{"$error":"#REF!"},{"$error":"#REF!"},{"$error":"#REF!"},{"$error":"#REF!"}]
[null,null,"00:00:00",{"$error":"#REF!"},{"$error":"#REF!"},{"$error":"#REF!"},{"$error":"#REF!"},{"$error":"#REF!"},{"$error":"#REF!"},{"$error":"#REF!"},{"$error":"#REF!"},{"$error":"#REF!"},{"$error":"#REF!"},{"$error":"#REF!"}]
[null,null,"00:00:00",{"$error":"#REF!"},{"$error":"#REF!"},{"$error":"#REF!"},{"$error":"#REF!"},{"$error":"#REF!"},{"$error":"#REF!"},{"$error":"#REF!"},{"$error":"#REF!"},{"$error":"#REF!"},{"$error":"#REF!"},{"$error":"#REF!"}]
[null,null,"00:00:00",{"$error":"#REF!"},{"$error":"#REF!"},{"$error":"#REF!"},{"$error":"#REF!"},{"$error":"#REF!"},{"$error":"#REF!"},{"$error":"#REF!"},{"$error":"#REF!"},{"$error":"#REF!"},{"$error":"#REF!"},{"$error":"#REF!"}]
[null,null,"00:00:00",{"$error":"#REF!"},{"$error":"#REF!"},{"$error":"#REF!"},{"$error":"#REF!"},{"$error":"#REF!"},{"$error":"#REF!"},{"$error":"#REF!"},{"$error":"#REF!"},{"$error":"#REF!"},{"$error":"#REF!"},{"$error":"#REF!"}]
[null,null,"00:00:00",{"$error":"#REF!"},{"$error":"#REF!"},{"$error":"#REF!"},{"$error":"#REF!"},{"$error":"#REF!"},{"$error":"#REF!"},{"$error":"#REF!"},{"$error":"#REF!"},{"$error":"#REF!"},{"$error":"#REF!"},{"$error":"#REF!"}]
[null,null,"00:00:00",{"$error":"#REF!"},{"$error":"#REF!"},{"$error":"#REF!"},{"$error":"#REF!"},{"$error":"#REF!"},{"$error":"#REF!"},{"$error":"#REF!"},{"$error":"#REF!"},{"$error":"#REF!"},{"$error":"#REF!"},{"$error":"#REF!"}]
[null,null,"00:00:00",{"$error":"#REF!"},{"$error":"#REF!"},{"$error":"#REF!"},{"$error":"#REF!"},{"$error":"#REF!"},{"$error":"#REF!"},{"$error":"#REF!"},{"$error":"#REF!"},{"$error":"#REF!"},{"$error":"#REF!"},{"$error":"#REF!"}]
[null,null,"00:00:00",{"$error":"#REF!"},{"$error":"#REF!"},{"$error":"#REF!"},{"$error":"#REF!"},{"$error":"#REF!"},{"$error":"#REF!"},{"$error":"#REF!"},{"$error":"#REF!"},{"$error":"#REF!"},{"$error":"#REF!"},{"$error":"#REF!"}]
[null,null,"00:00:00",{"$error":"#REF!"},{"$error":"#REF!"},{"$error":"#REF!"},{"$error":"#REF!"},{"$error":"#REF!"},{"$error":"#REF!"},{"$error":"#REF!"},{"$error":"#REF!"},{"$error":"#REF!"},{"$error":"#REF!"},{"$error":"#REF!"}]
[null,null,"00:00:00",{"$error":"#REF!"},{"$error":"#REF!"},{"$error":"#REF!"},{"$error":"#REF!"},{"$error":"#REF!"},{"$error":"#REF!"},{"$error":"#REF!"},{"$error":"#REF!"},{"$error":"#REF!"},{"$error":"#REF!"},{"$error":"#REF!"}]
[null,null,"00:00:00",{"$error":"#REF!"},{"$error":"#REF!"},{"$error":"#REF!"},{"$error":"#REF!"},{"$error":"#REF!"},{"$error":"#REF!"},{"$error":"#REF!"},{"$error":"#REF!"},{"$error":"#REF!"},{"$error":"#REF!"},{"$error":"#REF!"}]
[null,null,"00:00:00",{"$error":"#REF!"},{"$error":"#REF!"},{"$error":"#REF!"},{"$error":"#REF!"},{"$error":"#REF!"},{"$error":"#REF!"},{"$error":"#REF!"},{"$error":"#REF!"},{"$error":"#REF!"},{"$error":"#REF!"},{"$error":"#REF!"}]
[null,null,"00:00:00",{"$error":"#REF!"},{"$error":"#REF!"},{"$error":"#REF!"},{"$error":"#REF!"},{"$error":"#REF!"},{"$error":"#REF!"},{"$error":"#REF!"},{"$error":"#REF!"},{"$error":"#REF!"},{"$error":"#REF!"},{"$error":"#REF!"}]
[null,null,"00:00:00",{"$error":"#REF!"},{"$error":"#REF!"},{"$error":"#REF!"},{"$error":"#REF!"},{"$error":"#REF!"},{"$error":"#REF!"},{"$error":"#REF!"},{"$error":"#REF!"},{"$error":"#REF!"},{"$error":"#REF!"},{"$error":"#REF!"}]
[null,null,"00:00:00",{"$error":"#REF!"},{"$error":"#REF!"},{"$error":"#REF!"},{"$error":"#REF!"},{"$error":"#REF!"},{"$error":"#REF!"},{"$error":"#REF!"},{"$error":"#REF!"},{"$error":"#REF!"},{"$error":"#REF!"},{"$error":"#REF!"}]
[null,null,"00:00:00",{"$error":"#REF!"},{"$error":"#REF!"},{"$error":"#REF!"},{"$error":"#REF!"},{"$error":"#REF!"},{"$error":"#REF!"},{"$error":"#REF!"},{"$error":"#REF!"},{"$error":"#REF!"},{"$error":"#REF!"},{"$error":"#REF!"}]
[null,null,"00:00:00",{"$error":"#REF!"},{"$error":"#REF!"},{"$error":"#REF!"},{"$error":"#REF!"},{"$error":"#REF!"},{"$error":"#REF!"},{"$error":"#REF!"},{"$error":"#REF!"},{"$error":"#REF!"},{"$error":"#REF!"},{"$error":"#REF!"}]
[null,null,"00:00:00",{"$f":"$G$49","v":{"$error":"#REF!"}},{"$error":"#REF!"},{"$error":"#REF!"},{"$error":"#REF!"},{"$error":"#REF!"},{"$error":"#REF!"},{"$error":"#REF!"},{"$error":"#REF!"},{"$error":"#REF!"},{"$error":"#REF!"},{"$error":"#REF!"}]
[null,null,{"$f":"B610","v":"00:00:00"},{"$error":"#REF!"},{"$error":"#REF!"},{"$f":"+$C$80+$H$80","v":{"$error":"#REF!"}},{"$f":"+$C$78+$H$78","v":{"$error":"#REF!"}},{"$f":"+$C$76+$C$84","v":{"$error":"#REF!"}},{"$f":"D610-E610-F610-G610-H610","v":{"$error":"#REF!"}},{"$error":"#REF!"},{"$error":"#REF!"},{"$error":"#REF!"},{"$error":"#REF!"},{"$f":"M610-K610","v":{"$error":"#REF!"}}]
[null,null,"00:00:00",{"$error":"#REF!"},{"$f":"+$C$82+$H$82","v":{"$error":"#REF!"}},{"$error":"#REF!"},{"$error":"#REF!"},{"$error":"#REF!"},{"$error":"#REF!"},{"$error":"#REF!"},{"$error":"#REF!"},{"$f":"M610+I611","v":{"$error":"#REF!"}},{"$f":"L611*(1+$C$44)","v":{"$error":"#REF!"}},{"$error":"#REF!"}]
[null,null,"00:00:00",{"$error":"#REF!"},{"$error":"#REF!"},{"$error":"#REF!"},{"$error":"#REF!"},{"$error":"#REF!"},{"$error":"#REF!"},{"$f":"+K611+I612","v":{"$error":"#REF!"}},{"$error":"#REF!"},{"$error":"#REF!"},{"$error":"#REF!"},{"$error":"#REF!"}]
[null,null,"00:00:00",{"$error":"#REF!"},{"$error":"#REF!"},{"$error":"#REF!"},{"$error":"#REF!"},{"$error":"#REF!"},{"$error":"#REF!"},{"$error":"#REF!"},{"$f":"+(1+$C$42)*J613","v":{"$error":"#REF!"}},{"$error":"#REF!"},{"$error":"#REF!"},{"$error":"#REF!"}]
[null,null,"00:00:00",{"$error":"#REF!"},{"$error":"#REF!"},{"$error":"#REF!"},{"$error":"#REF!"},{"$error":"#REF!"},{"$error":"#REF!"},{"$error":"#REF!"},{"$error":"#REF!"},{"$error":"#REF!"},{"$error":"#REF!"},{"$error":"#REF!"}]
[null,null,"00:00:00",{"$error":"#REF!"},{"$error":"#REF!"},{"$error":"#REF!"},{"$error":"#REF!"},{"$error":"#REF!"},{"$error":"#REF!"},{"$error":"#REF!"},{"$error":"#REF!"},{"$error":"#REF!"},{"$error":"#REF!"},{"$error":"#REF!"}]
[null,null,"00:00:00",{"$error":"#REF!"},{"$error":"#REF!"},{"$error":"#REF!"},{"$error":"#REF!"},{"$error":"#REF!"},{"$error":"#REF!"},{"$error":"#REF!"},{"$error":"#REF!"},{"$error":"#REF!"},{"$error":"#REF!"},{"$error":"#REF!"}]
[null,null,"00:00:00",{"$error":"#REF!"},{"$error":"#REF!"},{"$error":"#REF!"},{"$error":"#REF!"},{"$error":"#REF!"},{"$error":"#REF!"},{"$error":"#REF!"},{"$error":"#REF!"},{"$error":"#REF!"},{"$error":"#REF!"},{"$error":"#REF!"}]
[null,null,"00:00:00",{"$error":"#REF!"},{"$error":"#REF!"},{"$error":"#REF!"},{"$error":"#REF!"},{"$error":"#REF!"},{"$error":"#REF!"},{"$error":"#REF!"},{"$error":"#REF!"},{"$error":"#REF!"},{"$error":"#REF!"},{"$error":"#REF!"}]
[null,null,"00:00:00",{"$error":"#REF!"},{"$error":"#REF!"},{"$error":"#REF!"},{"$error":"#REF!"},{"$error":"#REF!"},{"$error":"#REF!"},{"$error":"#REF!"},{"$error":"#REF!"},{"$error":"#REF!"},{"$error":"#REF!"},{"$error":"#REF!"}]
[null,null,"00:00:00",{"$error":"#REF!"},{"$error":"#REF!"},{"$error":"#REF!"},{"$error":"#REF!"},{"$error":"#REF!"},{"$error":"#REF!"},{"$error":"#REF!"},{"$error":"#REF!"},{"$error":"#REF!"},{"$error":"#REF!"},{"$error":"#REF!"}]
[null,null,"00:00:00",{"$error":"#REF!"},{"$error":"#REF!"},{"$error":"#REF!"},{"$error":"#REF!"},{"$error":"#REF!"},{"$error":"#REF!"},{"$error":"#REF!"},{"$error":"#REF!"},{"$error":"#REF!"},{"$error":"#REF!"},{"$error":"#REF!"}]
[null,null,"00:00:00",{"$error":"#REF!"},{"$error":"#REF!"},{"$error":"#REF!"},{"$error":"#REF!"},{"$error":"#REF!"},{"$error":"#REF!"},{"$error":"#REF!"},{"$error":"#REF!"},{"$error":"#REF!"},{"$error":"#REF!"},{"$error":"#REF!"}]
[null,null,"00:00:00",{"$error":"#REF!"},{"$error":"#REF!"},{"$error":"#REF!"},{"$error":"#REF!"},{"$error":"#REF!"},{"$error":"#REF!"},{"$error":"#REF!"},{"$error":"#REF!"},{"$error":"#REF!"},{"$error":"#REF!"},{"$error":"#REF!"}]
[null,null,"00:00:00",{"$error":"#REF!"},{"$error":"#REF!"},{"$error":"#REF!"},{"$error":"#REF!"},{"$error":"#REF!"},{"$error":"#REF!"},{"$error":"#REF!"},{"$error":"#REF!"},{"$error":"#REF!"},{"$error":"#REF!"},{"$error":"#REF!"}]
[null,null,"00:00:00",{"$error":"#REF!"},{"$error":"#REF!"},{"$error":"#REF!"},{"$error":"#REF!"},{"$error":"#REF!"},{"$error":"#REF!"},{"$error":"#REF!"},{"$error":"#REF!"},{"$error":"#REF!"},{"$error":"#REF!"},{"$error":"#REF!"}]
[null,null,"00:00:00",{"$error":"#REF!"},{"$error":"#REF!"},{"$error":"#REF!"},{"$error":"#REF!"},{"$error":"#REF!"},{"$error":"#REF!"},{"$error":"#REF!"},{"$error":"#REF!"},{"$error":"#REF!"},{"$error":"#REF!"},{"$error":"#REF!"}]
[null,null,"00:00:00",{"$error":"#REF!"},{"$error":"#REF!"},{"$error":"#REF!"},{"$error":"#REF!"},{"$error":"#REF!"},{"$error":"#REF!"},{"$error":"#REF!"},{"$error":"#REF!"},{"$error":"#REF!"},{"$error":"#REF!"},{"$error":"#REF!"}]
[null,null,"00:00:00",{"$error":"#REF!"},{"$error":"#REF!"},{"$error":"#REF!"},{"$error":"#REF!"},{"$error":"#REF!"},{"$error":"#REF!"},{"$error":"#REF!"},{"$error":"#REF!"},{"$error":"#REF!"},{"$error":"#REF!"},{"$error":"#REF!"}]
[null,null,"00:00:00",{"$error":"#REF!"},{"$error":"#REF!"},{"$error":"#REF!"},{"$error":"#REF!"},{"$error":"#REF!"},{"$error":"#REF!"},{"$error":"#REF!"},{"$error":"#REF!"},{"$error":"#REF!"},{"$error":"#REF!"},{"$error":"#REF!"}]
[null,null,"00:00:00",{"$error":"#REF!"},{"$error":"#REF!"},{"$error":"#REF!"},{"$error":"#REF!"},{"$error":"#REF!"},{"$error":"#REF!"},{"$error":"#REF!"},{"$error":"#REF!"},{"$error":"#REF!"},{"$error":"#REF!"},{"$error":"#REF!"}]
[null,null,"00:00:00",{"$error":"#REF!"},{"$error":"#REF!"},{"$error":"#REF!"},{"$error":"#REF!"},{"$error":"#REF!"},{"$error":"#REF!"},{"$error":"#REF!"},{"$error":"#REF!"},{"$error":"#REF!"},{"$error":"#REF!"},{"$error":"#REF!"}]
[null,null,"00:00:00",{"$error":"#REF!"},{"$error":"#REF!"},{"$error":"#REF!"},{"$error":"#REF!"},{"$error":"#REF!"},{"$error":"#REF!"},{"$error":"#REF!"},{"$error":"#REF!"},{"$error":"#REF!"},{"$error":"#REF!"},{"$error":"#REF!"}]
[null,null,"00:00:00",{"$error":"#REF!"},{"$error":"#REF!"},{"$error":"#REF!"},{"$error":"#REF!"},{"$error":"#REF!"},{"$error":"#REF!"},{"$error":"#REF!"},{"$error":"#REF!"},{"$error":"#REF!"},{"$error":"#REF!"},{"$error":"#REF!"}]
[null,null,"00:00:00",{"$error":"#REF!"},{"$error":"#REF!"},{"$error":"#REF!"},{"$error":"#REF!"},{"$error":"#REF!"},{"$error":"#REF!"},{"$error":"#REF!"},{"$error":"#REF!"},{"$error":"#REF!"},{"$error":"#REF!"},{"$error":"#REF!"}]
[null,null,"00:00:00",{"$error":"#REF!"},{"$error":"#REF!"},{"$error":"#REF!"},{"$error":"#REF!"},{"$error":"#REF!"},{"$error":"#REF!"},{"$error":"#REF!"},{"$error":"#REF!"},{"$error":"#REF!"},{"$error":"#REF!"},{"$error":"#REF!"}]
[null,null,"00:00:00",{"$error":"#REF!"},{"$error":"#REF!"},{"$error":"#REF!"},{"$error":"#REF!"},{"$error":"#REF!"},{"$error":"#REF!"},{"$error":"#REF!"},{"$error":"#REF!"},{"$error":"#REF!"},{"$error":"#REF!"},{"$error":"#REF!"}]
[null,null,"00:00:00",{"$error":"#REF!"},{"$error":"#REF!"},{"$error":"#REF!"},{"$error":"#REF!"},{"$error":"#REF!"},{"$error":"#REF!"},{"$error":"#REF!"},{"$error":"#REF!"},{"$error":"#REF!"},{"$error":"#REF!"},{"$error":"#REF!"}]
[null,null,"00:00:00",{"$error":"#REF!"},{"$error":"#REF!"},{"$error":"#REF!"},{"$error":"#REF!"},{"$error":"#REF!"},{"$error":"#REF!"},{"$error":"#REF!"},{"$error":"#REF!"},{"$error":"#REF!"},{"$error":"#REF!"},{"$error":"#REF!"}]
[null,null,"00:00:00",{"$error":"#REF!"},{"$error":"#REF!"},{"$error":"#REF!"},{"$error":"#REF!"},{"$error":"#REF!"},{"$error":"#REF!"},{"$error":"#REF!"},{"$error":"#REF!"},{"$error":"#REF!"},{"$error":"#REF!"},{"$error":"#REF!"}]
[null,null,"00:00:00",{"$error":"#REF!"},{"$error":"#REF!"},{"$error":"#REF!"},{"$error":"#REF!"},{"$error":"#REF!"},{"$error":"#REF!"},{"$error":"#REF!"},{"$error":"#REF!"},{"$error":"#REF!"},{"$error":"#REF!"},{"$error":"#REF!"}]
[null,null,"00:00:00",{"$error":"#REF!"},{"$error":"#REF!"},{"$error":"#REF!"},{"$error":"#REF!"},{"$error":"#REF!"},{"$error":"#REF!"},{"$error":"#REF!"},{"$error":"#REF!"},{"$error":"#REF!"},{"$error":"#REF!"},{"$error":"#REF!"}]
[null,null,"00:00:00",{"$error":"#REF!"},{"$error":"#REF!"},{"$error":"#REF!"},{"$error":"#REF!"},{"$error":"#REF!"},{"$error":"#REF!"},{"$error":"#REF!"},{"$error":"#REF!"},{"$error":"#REF!"},{"$error":"#REF!"},{"$error":"#REF!"}]
[null,null,"00:00:00",{"$error":"#REF!"},{"$error":"#REF!"},{"$error":"#REF!"},{"$error":"#REF!"},{"$error":"#REF!"},{"$error":"#REF!"},{"$error":"#REF!"},{"$error":"#REF!"},{"$error":"#REF!"},{"$error":"#REF!"},{"$error":"#REF!"}]
[null,null,"00:00:00",{"$error":"#REF!"},{"$error":"#REF!"},{"$error":"#REF!"},{"$error":"#REF!"},{"$error":"#REF!"},{"$error":"#REF!"},{"$error":"#REF!"},{"$error":"#REF!"},{"$error":"#REF!"},{"$error":"#REF!"},{"$error":"#REF!"}]
[null,null,"00:00:00",{"$error":"#REF!"},{"$error":"#REF!"},{"$error":"#REF!"},{"$error":"#REF!"},{"$error":"#REF!"},{"$error":"#REF!"},{"$error":"#REF!"},{"$error":"#REF!"},{"$error":"#REF!"},{"$error":"#REF!"},{"$error":"#REF!"}]
[null,null,"00:00:00",{"$error":"#REF!"},{"$error":"#REF!"},{"$error":"#REF!"},{"$error":"#REF!"},{"$error":"#REF!"},{"$error":"#REF!"},{"$error":"#REF!"},{"$error":"#REF!"},{"$error":"#REF!"},{"$error":"#REF!"},{"$error":"#REF!"}]
[null,null,"00:00:00",{"$error":"#REF!"},{"$error":"#REF!"},{"$error":"#REF!"},{"$error":"#REF!"},{"$error":"#REF!"},{"$error":"#REF!"},{"$error":"#REF!"},{"$error":"#REF!"},{"$error":"#REF!"},{"$error":"#REF!"},{"$error":"#REF!"}]
[null,null,"00:00:00",{"$error":"#REF!"},{"$error":"#REF!"},{"$error":"#REF!"},{"$error":"#REF!"},{"$error":"#REF!"},{"$error":"#REF!"},{"$error":"#REF!"},{"$error":"#REF!"},{"$error":"#REF!"},{"$error":"#REF!"},{"$error":"#REF!"}]
[null,null,"00:00:00",{"$error":"#REF!"},{"$error":"#REF!"},{"$error":"#REF!"},{"$error":"#REF!"},{"$error":"#REF!"},{"$error":"#REF!"},{"$error":"#REF!"},{"$error":"#REF!"},{"$error":"#REF!"},{"$error":"#REF!"},{"$error":"#REF!"}]
[null,null,"00:00:00",{"$error":"#REF!"},{"$error":"#REF!"},{"$error":"#REF!"},{"$error":"#REF!"},{"$error":"#REF!"},{"$error":"#REF!"},{"$error":"#REF!"},{"$error":"#REF!"},{"$error":"#REF!"},{"$error":"#REF!"},{"$error":"#REF!"}]
[null,null,"00:00:00",{"$error":"#REF!"},{"$error":"#REF!"},{"$error":"#REF!"},{"$error":"#REF!"},{"$error":"#REF!"},{"$error":"#REF!"},{"$error":"#REF!"},{"$error":"#REF!"},{"$error":"#REF!"},{"$error":"#REF!"},{"$error":"#REF!"}]
[null,null,"00:00:00",{"$error":"#REF!"},{"$error":"#REF!"},{"$error":"#REF!"},{"$error":"#REF!"},{"$error":"#REF!"},{"$error":"#REF!"},{"$error":"#REF!"},{"$error":"#REF!"},{"$error":"#REF!"},{"$error":"#REF!"},{"$error":"#REF!"}]
[null,null,"00:00:00",{"$error":"#REF!"},{"$error":"#REF!"},{"$error":"#REF!"},{"$error":"#REF!"},{"$error":"#REF!"},{"$error":"#REF!"},{"$error":"#REF!"},{"$error":"#REF!"},{"$error":"#REF!"},{"$error":"#REF!"},{"$error":"#REF!"}]
[null,null,"00:00:00",{"$error":"#REF!"},{"$error":"#REF!"},{"$error":"#REF!"},{"$error":"#REF!"},{"$error":"#REF!"},{"$error":"#REF!"},{"$error":"#REF!"},{"$error":"#REF!"},{"$error":"#REF!"},{"$error":"#REF!"},{"$error":"#REF!"}]
[null,null,"00:00:00",{"$error":"#REF!"},{"$error":"#REF!"},{"$error":"#REF!"},{"$error":"#REF!"},{"$error":"#REF!"},{"$error":"#REF!"},{"$error":"#REF!"},{"$error":"#REF!"},{"$error":"#REF!"},{"$error":"#REF!"},{"$error":"#REF!"}]
[null,null,"00:00:00",{"$error":"#REF!"},{"$error":"#REF!"},{"$error":"#REF!"},{"$error":"#REF!"},{"$error":"#REF!"},{"$error":"#REF!"},{"$error":"#REF!"},{"$error":"#REF!"},{"$error":"#REF!"},{"$error":"#REF!"},{"$error":"#REF!"}]
[null,null,"00:00:00",{"$error":"#REF!"},{"$error":"#REF!"},{"$error":"#REF!"},{"$error":"#REF!"},{"$error":"#REF!"},{"$error":"#REF!"},{"$error":"#REF!"},{"$error":"#REF!"},{"$error":"#REF!"},{"$error":"#REF!"},{"$error":"#REF!"}]
[null,null,"00:00:00",{"$error":"#REF!"},{"$error":"#REF!"},{"$error":"#REF!"},{"$error":"#REF!"},{"$error":"#REF!"},{"$error":"#REF!"},{"$error":"#REF!"},{"$error":"#REF!"},{"$error":"#REF!"},{"$error":"#REF!"},{"$error":"#REF!"}]
[null,null,"00:00:00",{"$error":"#REF!"},{"$error":"#REF!"},{"$error":"#REF!"},{"$error":"#REF!"},{"$error":"#REF!"},{"$error":"#REF!"},{"$error":"#REF!"},{"$error":"#REF!"},{"$error":"#REF!"},{"$error":"#REF!"},{"$error":"#REF!"}]
[null,null,"00:00:00",{"$error":"#REF!"},{"$error":"#REF!"},{"$error":"#REF!"},{"$error":"#REF!"},{"$error":"#REF!"},{"$error":"#REF!"},{"$error":"#REF!"},{"$error":"#REF!"},{"$error":"#REF!"},{"$error":"#REF!"},{"$error":"#REF!"}]
[null,null,"00:00:00",{"$error":"#REF!"},{"$error":"#REF!"},{"$error":"#REF!"},{"$error":"#REF!"},{"$error":"#REF!"},{"$error":"#REF!"},{"$error":"#REF!"},{"$error":"#REF!"},{"$error":"#REF!"},{"$error":"#REF!"},{"$error":"#REF!"}]
[null,null,"00:00:00",{"$error":"#REF!"},{"$error":"#REF!"},{"$error":"#REF!"},{"$error":"#REF!"},{"$error":"#REF!"},{"$error":"#REF!"},{"$error":"#REF!"},{"$error":"#REF!"},{"$error":"#REF!"},{"$error":"#REF!"},{"$error":"#REF!"}]
[null,null,"00:00:00",{"$error":"#REF!"},{"$error":"#REF!"},{"$error":"#REF!"},{"$error":"#REF!"},{"$error":"#REF!"},{"$error":"#REF!"},{"$error":"#REF!"},{"$error":"#REF!"},{"$error":"#REF!"},{"$error":"#REF!"},{"$error":"#REF!"}]
[null,null,"00:00:00",{"$error":"#REF!"},{"$error":"#REF!"},{"$error":"#REF!"},{"$error":"#REF!"},{"$error":"#REF!"},{"$error":"#REF!"},{"$error":"#REF!"},{"$error":"#REF!"},{"$error":"#REF!"},{"$error":"#REF!"},{"$error":"#REF!"}]
[null,null,"00:00:00",{"$error":"#REF!"},{"$error":"#REF!"},{"$error":"#REF!"},{"$error":"#REF!"},{"$error":"#REF!"},{"$error":"#REF!"},{"$error":"#REF!"},{"$error":"#REF!"},{"$error":"#REF!"},{"$error":"#REF!"},{"$error":"#REF!"}]
[null,null,"00:00:00",{"$error":"#REF!"},{"$error":"#REF!"},{"$error":"#REF!"},{"$error":"#REF!"},{"$error":"#REF!"},{"$error":"#REF!"},{"$error":"#REF!"},{"$error":"#REF!"},{"$error":"#REF!"},{"$error":"#REF!"},{"$error":"#REF!"}]
[null,null,"00:00:00",{"$error":"#REF!"},{"$error":"#REF!"},{"$error":"#REF!"},{"$error":"#REF!"},{"$error":"#REF!"},{"$error":"#REF!"},{"$error":"#REF!"},{"$error":"#REF!"},{"$error":"#REF!"},{"$error":"#REF!"},{"$error":"#REF!"}]
[null,null,"00:00:00",{"$error":"#REF!"},{"$error":"#REF!"},{"$error":"#REF!"},{"$error":"#REF!"},{"$error":"#REF!"},{"$error":"#REF!"},{"$error":"#REF!"},{"$error":"#REF!"},{"$error":"#REF!"},{"$error":"#REF!"},{"$error":"#REF!"}]
[null,null,"00:00:00",{"$error":"#REF!"},{"$error":"#REF!"},{"$error":"#REF!"},{"$error":"#REF!"},{"$error":"#REF!"},{"$error":"#REF!"},{"$error":"#REF!"},{"$error":"#REF!"},{"$error":"#REF!"},{"$error":"#REF!"},{"$error":"#REF!"}]
[null,null,"00:00:00",{"$error":"#REF!"},{"$error":"#REF!"},{"$error":"#REF!"},{"$error":"#REF!"},{"$error":"#REF!"},{"$error":"#REF!"},{"$error":"#REF!"},{"$error":"#REF!"},{"$error":"#REF!"},{"$error":"#REF!"},{"$error":"#REF!"}]
[null,null,"00:00:00",{"$error":"#REF!"},{"$error":"#REF!"},{"$error":"#REF!"},{"$error":"#REF!"},{"$error":"#REF!"},{"$error":"#REF!"},{"$error":"#REF!"},{"$error":"#REF!"},{"$error":"#REF!"},{"$error":"#REF!"},{"$error":"#REF!"}]
[null,null,"00:00:00",{"$error":"#REF!"},{"$error":"#REF!"},{"$error":"#REF!"},{"$error":"#REF!"},{"$error":"#REF!"},{"$error":"#REF!"},{"$error":"#REF!"},{"$error":"#REF!"},{"$error":"#REF!"},{"$error":"#REF!"},{"$error":"#REF!"}]
[null,null,"00:00:00",{"$f":"$G$49","v":{"$error":"#REF!"}},{"$error":"#REF!"},{"$error":"#REF!"},{"$error":"#REF!"},{"$error":"#REF!"},{"$error":"#REF!"},{"$error":"#REF!"},{"$error":"#REF!"},{"$error":"#REF!"},{"$error":"#REF!"},{"$error":"#REF!"}]
[null,null,{"$f":"B674","v":"00:00:00"},{"$error":"#REF!"},{"$error":"#REF!"},{"$f":"+$C$80+$H$80","v":{"$error":"#REF!"}},{"$f":"+$C$78+$H$78","v":{"$error":"#REF!"}},{"$f":"+$C$76+$C$84","v":{"$error":"#REF!"}},{"$f":"D674-E674-F674-G674-H674","v":{"$error":"#REF!"}},{"$error":"#REF!"},{"$error":"#REF!"},{"$error":"#REF!"},{"$error":"#REF!"},{"$f":"M674-K674","v":{"$error":"#REF!"}}]
[null,null,"00:00:00",{"$error":"#REF!"},{"$f":"+$C$82+$H$82","v":{"$error":"#REF!"}},{"$error":"#REF!"},{"$error":"#REF!"},{"$error":"#REF!"},{"$error":"#REF!"},{"$error":"#REF!"},{"$error":"#REF!"},{"$f":"M674+I675","v":{"$error":"#REF!"}},{"$f":"L675*(1+$C$44)","v":{"$error":"#REF!"}},{"$error":"#REF!"}]
[null,null,"00:00:00",{"$error":"#REF!"},{"$error":"#REF!"},{"$error":"#REF!"},{"$error":"#REF!"},{"$error":"#REF!"},{"$error":"#REF!"},{"$f":"+K675+I676","v":{"$error":"#REF!"}},{"$error":"#REF!"},{"$error":"#REF!"},{"$error":"#REF!"},{"$error":"#REF!"}]
[null,null,"00:00:00",{"$error":"#REF!"},{"$error":"#REF!"},{"$error":"#REF!"},{"$error":"#REF!"},{"$error":"#REF!"},{"$error":"#REF!"},{"$error":"#REF!"},{"$f":"+(1+$C$42)*J677","v":{"$error":"#REF!"}},{"$error":"#REF!"},{"$error":"#REF!"},{"$error":"#REF!"}]
[null,null,"00:00:00",{"$error":"#REF!"},{"$error":"#REF!"},{"$error":"#REF!"},{"$error":"#REF!"},{"$error":"#REF!"},{"$error":"#REF!"},{"$error":"#REF!"},{"$error":"#REF!"},{"$error":"#REF!"},{"$error":"#REF!"},{"$error":"#REF!"}]
[null,null,"00:00:00",{"$error":"#REF!"},{"$error":"#REF!"},{"$error":"#REF!"},{"$error":"#REF!"},{"$error":"#REF!"},{"$error":"#REF!"},{"$error":"#REF!"},{"$error":"#REF!"},{"$error":"#REF!"},{"$error":"#REF!"},{"$error":"#REF!"}]
[null,null,"00:00:00",{"$error":"#REF!"},{"$error":"#REF!"},{"$error":"#REF!"},{"$error":"#REF!"},{"$error":"#REF!"},{"$error":"#REF!"},{"$error":"#REF!"},{"$error":"#REF!"},{"$error":"#REF!"},{"$error":"#REF!"},{"$error":"#REF!"}]
[null,null,"00:00:00",{"$error":"#REF!"},{"$error":"#REF!"},{"$error":"#REF!"},{"$error":"#REF!"},{"$error":"#REF!"},{"$error":"#REF!"},{"$error":"#REF!"},{"$error":"#REF!"},{"$error":"#REF!"},{"$error":"#REF!"},{"$error":"#REF!"}]
[null,null,"00:00:00",{"$error":"#REF!"},{"$error":"#REF!"},{"$error":"#REF!"},{"$error":"#REF!"},{"$error":"#REF!"},{"$error":"#REF!"},{"$error":"#REF!"},{"$error":"#REF!"},{"$error":"#REF!"},{"$error":"#REF!"},{"$error":"#REF!"}]
[null,null,"00:00:00",{"$error":"#REF!"},{"$error":"#REF!"},{"$error":"#REF!"},{"$error":"#REF!"},{"$error":"#REF!"},{"$error":"#REF!"},{"$error":"#REF!"},{"$error":"#REF!"},{"$error":"#REF!"},{"$error":"#REF!"},{"$error":"#REF!"}]
[null,null,"00:00:00",{"$error":"#REF!"},{"$error":"#REF!"},{"$error":"#REF!"},{"$error":"#REF!"},{"$error":"#REF!"},{"$error":"#REF!"},{"$error":"#REF!"},{"$error":"#REF!"},{"$error":"#REF!"},{"$error":"#REF!"},{"$error":"#REF!"}]
[null,null,"00:00:00",{"$error":"#REF!"},{"$error":"#REF!"},{"$error":"#REF!"},{"$error":"#REF!"},{"$error":"#REF!"},{"$error":"#REF!"},{"$error":"#REF!"},{"$error":"#REF!"},{"$error":"#REF!"},{"$error":"#REF!"},{"$error":"#REF!"}]
[null,null,"00:00:00",{"$error":"#REF!"},{"$error":"#REF!"},{"$error":"#REF!"},{"$error":"#REF!"},{"$error":"#REF!"},{"$error":"#REF!"},{"$error":"#REF!"},{"$error":"#REF!"},{"$error":"#REF!"},{"$error":"#REF!"},{"$error":"#REF!"}]
[null,null,"00:00:00",{"$error":"#REF!"},{"$error":"#REF!"},{"$error":"#REF!"},{"$error":"#REF!"},{"$error":"#REF!"},{"$error":"#REF!"},{"$error":"#REF!"},{"$error":"#REF!"},{"$error":"#REF!"},{"$error":"#REF!"},{"$error":"#REF!"}]
[null,null,"00:00:00",{"$error":"#REF!"},{"$error":"#REF!"},{"$error":"#REF!"},{"$error":"#REF!"},{"$error":"#REF!"},{"$error":"#REF!"},{"$error":"#REF!"},{"$error":"#REF!"},{"$error":"#REF!"},{"$error":"#REF!"},{"$error":"#REF!"}]
[null,null,"00:00:00",{"$error":"#REF!"},{"$error":"#REF!"},{"$error":"#REF!"},{"$error":"#REF!"},{"$error":"#REF!"},{"$error":"#REF!"},{"$error":"#REF!"},{"$error":"#REF!"},{"$error":"#REF!"},{"$error":"#REF!"},{"$error":"#REF!"}]
[null,null,"00:00:00",{"$error":"#REF!"},{"$error":"#REF!"},{"$error":"#REF!"},{"$error":"#REF!"},{"$error":"#REF!"},{"$error":"#REF!"},{"$error":"#REF!"},{"$error":"#REF!"},{"$error":"#REF!"},{"$error":"#REF!"},{"$error":"#REF!"}]
[null,null,"00:00:00",{"$error":"#REF!"},{"$error":"#REF!"},{"$error":"#REF!"},{"$error":"#REF!"},{"$error":"#REF!"},{"$error":"#REF!"},{"$error":"#REF!"},{"$error":"#REF!"},{"$error":"#REF!"},{"$error":"#REF!"},{"$error":"#REF!"}]
[null,null,"00:00:00",{"$error":"#REF!"},{"$error":"#REF!"},{"$error":"#REF!"},{"$error":"#REF!"},{"$error":"#REF!"},{"$error":"#REF!"},{"$error":"#REF!"},{"$error":"#REF!"},{"$error":"#REF!"},{"$error":"#REF!"},{"$error":"#REF!"}]
[null,null,"00:00:00",{"$error":"#REF!"},{"$error":"#REF!"},{"$error":"#REF!"},{"$error":"#REF!"},{"$error":"#REF!"},{"$error":"#REF!"},{"$error":"#REF!"},{"$error":"#REF!"},{"$error":"#REF!"},{"$error":"#REF!"},{"$error":"#REF!"}]
[null,null,"00:00:00",{"$error":"#REF!"},{"$error":"#REF!"},{"$error":"#REF!"},{"$error":"#REF!"},{"$error":"#REF!"},{"$error":"#REF!"},{"$error":"#REF!"},{"$error":"#REF!"},{"$error":"#REF!"},{"$error":"#REF!"},{"$error":"#REF!"}]
[null,null,"00:00:00",{"$error":"#REF!"},{"$error":"#REF!"},{"$error":"#REF!"},{"$error":"#REF!"},{"$error":"#REF!"},{"$error":"#REF!"},{"$error":"#REF!"},{"$error":"#REF!"},{"$error":"#REF!"},{"$error":"#REF!"},{"$error":"#REF!"}]
[null,null,"00:00:00",{"$error":"#REF!"},{"$error":"#REF!"},{"$error":"#REF!"},{"$error":"#REF!"},{"$error":"#REF!"},{"$error":"#REF!"},{"$error":"#REF!"},{"$error":"#REF!"},{"$error":"#REF!"},{"$error":"#REF!"},{"$error":"#REF!"}]
[null,null,"00:00:00",{"$error":"#REF!"},{"$error":"#REF!"},{"$error":"#REF!"},{"$error":"#REF!"},{"$error":"#REF!"},{"$error":"#REF!"},{"$error":"#REF!"},{"$error":"#REF!"},{"$error":"#REF!"},{"$error":"#REF!"},{"$error":"#REF!"}]
[null,null,"00:00:00",{"$error":"#REF!"},{"$error":"#REF!"},{"$error":"#REF!"},{"$error":"#REF!"},{"$error":"#REF!"},{"$error":"#REF!"},{"$error":"#REF!"},{"$error":"#REF!"},{"$error":"#REF!"},{"$error":"#REF!"},{"$error":"#REF!"}]
[null,null,"00:00:00",{"$error":"#REF!"},{"$error":"#REF!"},{"$error":"#REF!"},{"$error":"#REF!"},{"$error":"#REF!"},{"$error":"#REF!"},{"$error":"#REF!"},{"$error":"#REF!"},{"$error":"#REF!"},{"$error":"#REF!"},{"$error":"#REF!"}]
[null,null,"00:00:00",{"$error":"#REF!"},{"$error":"#REF!"},{"$error":"#REF!"},{"$error":"#REF!"},{"$error":"#REF!"},{"$error":"#REF!"},{"$error":"#REF!"},{"$error":"#REF!"},{"$error":"#REF!"},{"$error":"#REF!"},{"$error":"#REF!"}]
[null,null,"00:00:00",{"$error":"#REF!"},{"$error":"#REF!"},{"$error":"#REF!"},{"$error":"#REF!"},{"$error":"#REF!"},{"$error":"#REF!"},{"$error":"#REF!"},{"$error":"#REF!"},{"$error":"#REF!"},{"$error":"#REF!"},{"$error":"#REF!"}]
[null,null,"00:00:00",{"$error":"#REF!"},{"$error":"#REF!"},{"$error":"#REF!"},{"$error":"#REF!"},{"$error":"#REF!"},{"$error":"#REF!"},{"$error":"#REF!"},{"$error":"#REF!"},{"$error":"#REF!"},{"$error":"#REF!"},{"$error":"#REF!"}]
[null,null,"00:00:00",{"$error":"#REF!"},{"$error":"#REF!"},{"$error":"#REF!"},{"$error":"#REF!"},{"$error":"#REF!"},{"$error":"#REF!"},{"$error":"#REF!"},{"$error":"#REF!"},{"$error":"#REF!"},{"$error":"#REF!"},{"$error":"#REF!"}]
[null,null,"00:00:00",{"$error":"#REF!"},{"$error":"#REF!"},{"$error":"#REF!"},{"$error":"#REF!"},{"$error":"#REF!"},{"$error":"#REF!"},{"$error":"#REF!"},{"$error":"#REF!"},{"$error":"#REF!"},{"$error":"#REF!"},{"$error":"#REF!"}]
[null,null,"00:00:00",{"$error":"#REF!"},{"$error":"#REF!"},{"$error":"#REF!"},{"$error":"#REF!"},{"$error":"#REF!"},{"$error":"#REF!"},{"$error":"#REF!"},{"$error":"#REF!"},{"$error":"#REF!"},{"$error":"#REF!"},{"$error":"#REF!"}]
[null,null,"00:00:00",{"$error":"#REF!"},{"$error":"#REF!"},{"$error":"#REF!"},{"$error":"#REF!"},{"$error":"#REF!"},{"$error":"#REF!"},{"$error":"#REF!"},{"$error":"#REF!"},{"$error":"#REF!"},{"$error":"#REF!"},{"$error":"#REF!"}]
[null,null,"00:00:00",{"$error":"#REF!"},{"$error":"#REF!"},{"$error":"#REF!"},{"$error":"#REF!"},{"$error":"#REF!"},{"$error":"#REF!"},{"$error":"#REF!"},{"$error":"#REF!"},{"$error":"#REF!"},{"$error":"#REF!"},{"$error":"#REF!"}]
[null,null,"00:00:00",{"$error":"#REF!"},{"$error":"#REF!"},{"$error":"#REF!"},{"$error":"#REF!"},{"$error":"#REF!"},{"$error":"#REF!"},{"$error":"#REF!"},{"$error":"#REF!"},{"$error":"#REF!"},{"$error":"#REF!"},{"$error":"#REF!"}]
[null,null,"00:00:00",{"$error":"#REF!"},{"$error":"#REF!"},{"$error":"#REF!"},{"$error":"#REF!"},{"$error":"#REF!"},{"$error":"#REF!"},{"$error":"#REF!"},{"$error":"#REF!"},{"$error":"#REF!"},{"$error":"#REF!"},{"$error":"#REF!"}]
[null,null,"00:00:00",{"$error":"#REF!"},{"$error":"#REF!"},{"$error":"#REF!"},{"$error":"#REF!"},{"$error":"#REF!"},{"$error":"#REF!"},{"$error":"#REF!"},{"$error":"#REF!"},{"$error":"#REF!"},{"$error":"#REF!"},{"$error":"#REF!"}]
[null,null,"00:00:00",{"$error":"#REF!"},{"$error":"#REF!"},{"$error":"#REF!"},{"$error":"#REF!"},{"$error":"#REF!"},{"$error":"#REF!"},{"$error":"#REF!"},{"$error":"#REF!"},{"$error":"#REF!"},{"$error":"#REF!"},{"$error":"#REF!"}]
[null,null,"00:00:00",{"$error":"#REF!"},{"$error":"#REF!"},{"$error":"#REF!"},{"$error":"#REF!"},{"$error":"#REF!"},{"$error":"#REF!"},{"$error":"#REF!"},{"$error":"#REF!"},{"$error":"#REF!"},{"$error":"#REF!"},{"$error":"#REF!"}]
[null,null,"00:00:00",{"$error":"#REF!"},{"$error":"#REF!"},{"$error":"#REF!"},{"$error":"#REF!"},{"$error":"#REF!"},{"$error":"#REF!"},{"$error":"#REF!"},{"$error":"#REF!"},{"$error":"#REF!"},{"$error":"#REF!"},{"$error":"#REF!"}]
[null,null,"00:00:00",{"$error":"#REF!"},{"$error":"#REF!"},{"$error":"#REF!"},{"$error":"#REF!"},{"$error":"#REF!"},{"$error":"#REF!"},{"$error":"#REF!"},{"$error":"#REF!"},{"$error":"#REF!"},{"$error":"#REF!"},{"$error":"#REF!"}]
[null,null,"00:00:00",{"$error":"#REF!"},{"$error":"#REF!"},{"$error":"#REF!"},{"$error":"#REF!"},{"$error":"#REF!"},{"$error":"#REF!"},{"$error":"#REF!"},{"$error":"#REF!"},{"$error":"#REF!"},{"$error":"#REF!"},{"$error":"#REF!"}]
[null,null,"00:00:00",{"$error":"#REF!"},{"$error":"#REF!"},{"$error":"#REF!"},{"$error":"#REF!"},{"$error":"#REF!"},{"$error":"#REF!"},{"$error":"#REF!"},{"$error":"#REF!"},{"$error":"#REF!"},{"$error":"#REF!"},{"$error":"#REF!"}]
[null,null,"00:00:00",{"$error":"#REF!"},{"$error":"#REF!"},{"$error":"#REF!"},{"$error":"#REF!"},{"$error":"#REF!"},{"$error":"#REF!"},{"$error":"#REF!"},{"$error":"#REF!"},{"$error":"#REF!"},{"$error":"#REF!"},{"$error":"#REF!"}]
[null,null,"00:00:00",{"$error":"#REF!"},{"$error":"#REF!"},{"$error":"#REF!"},{"$error":"#REF!"},{"$error":"#REF!"},{"$error":"#REF!"},{"$error":"#REF!"},{"$error":"#REF!"},{"$error":"#REF!"},{"$error":"#REF!"},{"$error":"#REF!"}]
[null,null,"00:00:00",{"$error":"#REF!"},{"$error":"#REF!"},{"$error":"#REF!"},{"$error":"#REF!"},{"$error":"#REF!"},{"$error":"#REF!"},{"$error":"#REF!"},{"$error":"#REF!"},{"$error":"#REF!"},{"$error":"#REF!"},{"$error":"#REF!"}]
[null,null,"00:00:00",{"$error":"#REF!"},{"$error":"#REF!"},{"$error":"#REF!"},{"$error":"#REF!"},{"$error":"#REF!"},{"$error":"#REF!"},{"$error":"#REF!"},{"$error":"#REF!"},{"$error":"#REF!"},{"$error":"#REF!"},{"$error":"#REF!"}]
[null,null,"00:00:00",{"$error":"#REF!"},{"$error":"#REF!"},{"$error":"#REF!"},{"$error":"#REF!"},{"$error":"#REF!"},{"$error":"#REF!"},{"$error":"#REF!"},{"$error":"#REF!"},{"$error":"#REF!"},{"$error":"#REF!"},{"$error":"#REF!"}]
[null,null,"00:00:00",{"$error":"#REF!"},{"$error":"#REF!"},{"$error":"#REF!"},{"$error":"#REF!"},{"$error":"#REF!"},{"$error":"#REF!"},{"$error":"#REF!"},{"$error":"#REF!"},{"$error":"#REF!"},{"$error":"#REF!"},{"$error":"#REF!"}]
[null,null,"00:00:00",{"$error":"#REF!"},{"$error":"#REF!"},{"$error":"#REF!"},{"$error":"#REF!"},{"$error":"#REF!"},{"$error":"#REF!"},{"$error":"#REF!"},{"$error":"#REF!"},{"$error":"#REF!"},{"$error":"#REF!"},{"$error":"#REF!"}]
[null,null,"00:00:00",{"$error":"#REF!"},{"$error":"#REF!"},{"$error":"#REF!"},{"$error":"#REF!"},{"$error":"#REF!"},{"$error":"#REF!"},{"$error":"#REF!"},{"$error":"#REF!"},{"$error":"#REF!"},{"$error":"#REF!"},{"$error":"#REF!"}]
[null,null,"00:00:00",{"$error":"#REF!"},{"$error":"#REF!"},{"$error":"#REF!"},{"$error":"#REF!"},{"$error":"#REF!"},{"$error":"#REF!"},{"$error":"#REF!"},{"$error":"#REF!"},{"$error":"#REF!"},{"$error":"#REF!"},{"$error":"#REF!"}]
[null,null,"00:00:00",{"$error":"#REF!"},{"$error":"#REF!"},{"$error":"#REF!"},{"$error":"#REF!"},{"$error":"#REF!"},{"$error":"#REF!"},{"$error":"#REF!"},{"$error":"#REF!"},{"$error":"#REF!"},{"$error":"#REF!"},{"$error":"#REF!"}]
[null,null,"00:00:00",{"$error":"#REF!"},{"$error":"#REF!"},{"$error":"#REF!"},{"$error":"#REF!"},{"$error":"#REF!"},{"$error":"#REF!"},{"$error":"#REF!"},{"$error":"#REF!"},{"$error":"#REF!"},{"$error":"#REF!"},{"$error":"#REF!"}]
[null,null,"00:00:00",{"$error":"#REF!"},{"$error":"#REF!"},{"$error":"#REF!"},{"$error":"#REF!"},{"$error":"#REF!"},{"$error":"#REF!"},{"$error":"#REF!"},{"$error":"#REF!"},{"$error":"#REF!"},{"$error":"#REF!"},{"$error":"#REF!"}]
[null,null,"00:00:00",{"$error":"#REF!"},{"$error":"#REF!"},{"$error":"#REF!"},{"$error":"#REF!"},{"$error":"#REF!"},{"$error":"#REF!"},{"$error":"#REF!"},{"$error":"#REF!"},{"$error":"#REF!"},{"$error":"#REF!"},{"$error":"#REF!"}]
[null,null,"00:00:00",{"$error":"#REF!"},{"$error":"#REF!"},{"$error":"#REF!"},{"$error":"#REF!"},{"$error":"#REF!"},{"$error":"#REF!"},{"$error":"#REF!"},{"$error":"#REF!"},{"$error":"#REF!"},{"$error":"#REF!"},{"$error":"#REF!"}]
[null,null,"00:00:00",{"$error":"#REF!"},{"$error":"#REF!"},{"$error":"#REF!"},{"$error":"#REF!"},{"$error":"#REF!"},{"$error":"#REF!"},{"$error":"#REF!"},{"$error":"#REF!"},{"$error":"#REF!"},{"$error":"#REF!"},{"$error":"#REF!"}]
[null,null,"00:00:00",{"$error":"#REF!"},{"$error":"#REF!"},{"$error":"#REF!"},{"$error":"#REF!"},{"$error":"#REF!"},{"$error":"#REF!"},{"$error":"#REF!"},{"$error":"#REF!"},{"$error":"#REF!"},{"$error":"#REF!"},{"$error":"#REF!"}]
[null,null,"00:00:00",{"$error":"#REF!"},{"$error":"#REF!"},{"$error":"#REF!"},{"$error":"#REF!"},{"$error":"#REF!"},{"$error":"#REF!"},{"$error":"#REF!"},{"$error":"#REF!"},{"$error":"#REF!"},{"$error":"#REF!"},{"$error":"#REF!"}]
[null,null,"00:00:00",{"$error":"#REF!"},{"$error":"#REF!"},{"$error":"#REF!"},{"$error":"#REF!"},{"$error":"#REF!"},{"$error":"#REF!"},{"$error":"#REF!"},{"$error":"#REF!"},{"$error":"#REF!"},{"$error":"#REF!"},{"$error":"#REF!"}]
[null,null,"00:00:00",{"$error":"#REF!"},{"$error":"#REF!"},{"$error":"#REF!"},{"$error":"#REF!"},{"$error":"#REF!"},{"$error":"#REF!"},{"$error":"#REF!"},{"$error":"#REF!"},{"$error":"#REF!"},{"$error":"#REF!"},{"$error":"#REF!"}]
[null,null,"00:00:00",{"$error":"#REF!"},{"$error":"#REF!"},{"$error":"#REF!"},{"$error":"#REF!"},{"$error":"#REF!"},{"$error":"#REF!"},{"$error":"#REF!"},{"$error":"#REF!"},{"$error":"#REF!"},{"$error":"#REF!"},{"$error":"#REF!"}]
[null,null,"00:00:00",{"$f":"$G$49","v":{"$error":"#REF!"}},{"$error":"#REF!"},{"$error":"#REF!"},{"$error":"#REF!"},{"$error":"#REF!"},{"$error":"#REF!"},{"$error":"#REF!"},{"$error":"#REF!"},{"$error":"#REF!"},{"$error":"#REF!"},{"$error":"#REF!"}]
[null,null,{"$f":"B738","v":"00:00:00"},{"$error":"#REF!"},{"$error":"#REF!"},{"$f":"+$C$80+$H$80","v":{"$error":"#REF!"}},{"$f":"+$C$78+$H$78","v":{"$error":"#REF!"}},{"$f":"+$C$76+$C$84","v":{"$error":"#REF!"}},{"$f":"D738-E738-F738-G738-H738","v":{"$error":"#REF!"}},{"$error":"#REF!"},{"$error":"#REF!"},{"$error":"#REF!"},{"$error":"#REF!"},{"$f":"M738-K738","v":{"$error":"#REF!"}}]
[null,null,"00:00:00",{"$error":"#REF!"},{"$f":"+$C$82+$H$82","v":{"$error":"#REF!"}},{"$error":"#REF!"},{"$error":"#REF!"},{"$error":"#REF!"},{"$error":"#REF!"},{"$error":"#REF!"},{"$error":"#REF!"},{"$f":"M738+I739","v":{"$error":"#REF!"}},{"$f":"L739*(1+$C$44)","v":{"$error":"#REF!"}},{"$error":"#REF!"}]
[null,null,"00:00:00",{"$error":"#REF!"},{"$error":"#REF!"},{"$error":"#REF!"},{"$error":"#REF!"},{"$error":"#REF!"},{"$error":"#REF!"},{"$f":"+K739+I740","v":{"$error":"#REF!"}},{"$error":"#REF!"},{"$error":"#REF!"},{"$error":"#REF!"},{"$error":"#REF!"}]
[null,null,"00:00:00",{"$error":"#REF!"},{"$error":"#REF!"},{"$error":"#REF!"},{"$error":"#REF!"},{"$error":"#REF!"},{"$error":"#REF!"},{"$error":"#REF!"},{"$f":"+(1+$C$42)*J741","v":{"$error":"#REF!"}},{"$error":"#REF!"},{"$error":"#REF!"},{"$error":"#REF!"}]
[null,null,"00:00:00",{"$error":"#REF!"},{"$error":"#REF!"},{"$error":"#REF!"},{"$error":"#REF!"},{"$error":"#REF!"},{"$error":"#REF!"},{"$error":"#REF!"},{"$error":"#REF!"},{"$error":"#REF!"},{"$error":"#REF!"},{"$error":"#REF!"}]
[null,null,"00:00:00",{"$error":"#REF!"},{"$error":"#REF!"},{"$error":"#REF!"},{"$error":"#REF!"},{"$error":"#REF!"},{"$error":"#REF!"},{"$error":"#REF!"},{"$error":"#REF!"},{"$error":"#REF!"},{"$error":"#REF!"},{"$error":"#REF!"}]
[null,null,"00:00:00",{"$error":"#REF!"},{"$error":"#REF!"},{"$error":"#REF!"},{"$error":"#REF!"},{"$error":"#REF!"},{"$error":"#REF!"},{"$error":"#REF!"},{"$error":"#REF!"},{"$error":"#REF!"},{"$error":"#REF!"},{"$error":"#REF!"}]
[null,null,"00:00:00",{"$error":"#REF!"},{"$error":"#REF!"},{"$error":"#REF!"},{"$error":"#REF!"},{"$error":"#REF!"},{"$error":"#REF!"},{"$error":"#REF!"},{"$error":"#REF!"},{"$error":"#REF!"},{"$error":"#REF!"},{"$error":"#REF!"}]
[null,null,"00:00:00",{"$error":"#REF!"},{"$error":"#REF!"},{"$error":"#REF!"},{"$error":"#REF!"},{"$error":"#REF!"},{"$error":"#REF!"},{"$error":"#REF!"},{"$error":"#REF!"},{"$error":"#REF!"},{"$error":"#REF!"},{"$error":"#REF!"}]
[null,null,"00:00:00",{"$error":"#REF!"},{"$error":"#REF!"},{"$error":"#REF!"},{"$error":"#REF!"},{"$error":"#REF!"},{"$error":"#REF!"},{"$error":"#REF!"},{"$error":"#REF!"},{"$error":"#REF!"},{"$error":"#REF!"},{"$error":"#REF!"}]
[null,null,"00:00:00",{"$error":"#REF!"},{"$error":"#REF!"},{"$error":"#REF!"},{"$error":"#REF!"},{"$error":"#REF!"},{"$error":"#REF!"},{"$error":"#REF!"},{"$error":"#REF!"},{"$error":"#REF!"},{"$error":"#REF!"},{"$error":"#REF!"}]
[null,null,"00:00:00",{"$error":"#REF!"},{"$error":"#REF!"},{"$error":"#REF!"},{"$error":"#REF!"},{"$error":"#REF!"},{"$error":"#REF!"},{"$error":"#REF!"},{"$error":"#REF!"},{"$error":"#REF!"},{"$error":"#REF!"},{"$error":"#REF!"}]
[null,null,"00:00:00",{"$error":"#REF!"},{"$error":"#REF!"},{"$error":"#REF!"},{"$error":"#REF!"},{"$error":"#REF!"},{"$error":"#REF!"},{"$error":"#REF!"},{"$error":"#REF!"},{"$error":"#REF!"},{"$error":"#REF!"},{"$error":"#REF!"}]
[null,null,"00:00:00",{"$error":"#REF!"},{"$error":"#REF!"},{"$error":"#REF!"},{"$error":"#REF!"},{"$error":"#REF!"},{"$error":"#REF!"},{"$error":"#REF!"},{"$error":"#REF!"},{"$error":"#REF!"},{"$error":"#REF!"},{"$error":"#REF!"}]
[null,null,"00:00:00",{"$error":"#REF!"},{"$error":"#REF!"},{"$error":"#REF!"},{"$error":"#REF!"},{"$error":"#REF!"},{"$error":"#REF!"},{"$error":"#REF!"},{"$error":"#REF!"},{"$error":"#REF!"},{"$error":"#REF!"},{"$error":"#REF!"}]
[null,null,"00:00:00",{"$error":"#REF!"},{"$error":"#REF!"},{"$error":"#REF!"},{"$error":"#REF!"},{"$error":"#REF!"},{"$error":"#REF!"},{"$error":"#REF!"},{"$error":"#REF!"},{"$error":"#REF!"},{"$error":"#REF!"},{"$error":"#REF!"}]
[null,null,"00:00:00",{"$error":"#REF!"},{"$error":"#REF!"},{"$error":"#REF!"},{"$error":"#REF!"},{"$error":"#REF!"},{"$error":"#REF!"},{"$error":"#REF!"},{"$error":"#REF!"},{"$error":"#REF!"},{"$error":"#REF!"},{"$error":"#REF!"}]
[null,null,"00:00:00",{"$error":"#REF!"},{"$error":"#REF!"},{"$error":"#REF!"},{"$error":"#REF!"},{"$error":"#REF!"},{"$error":"#REF!"},{"$error":"#REF!"},{"$error":"#REF!"},{"$error":"#REF!"},{"$error":"#REF!"},{"$error":"#REF!"}]
[null,null,"00:00:00",{"$error":"#REF!"},{"$error":"#REF!"},{"$error":"#REF!"},{"$error":"#REF!"},{"$error":"#REF!"},{"$error":"#REF!"},{"$error":"#REF!"},{"$error":"#REF!"},{"$error":"#REF!"},{"$error":"#REF!"},{"$error":"#REF!"}]
[null,null,"00:00:00",{"$error":"#REF!"},{"$error":"#REF!"},{"$error":"#REF!"},{"$error":"#REF!"},{"$error":"#REF!"},{"$error":"#REF!"},{"$error":"#REF!"},{"$error":"#REF!"},{"$error":"#REF!"},{"$error":"#REF!"},{"$error":"#REF!"}]
[null,null,"00:00:00",{"$error":"#REF!"},{"$error":"#REF!"},{"$error":"#REF!"},{"$error":"#REF!"},{"$error":"#REF!"},{"$error":"#REF!"},{"$error":"#REF!"},{"$error":"#REF!"},{"$error":"#REF!"},{"$error":"#REF!"},{"$error":"#REF!"}]
[null,null,"00:00:00",{"$error":"#REF!"},{"$error":"#REF!"},{"$error":"#REF!"},{"$error":"#REF!"},{"$error":"#REF!"},{"$error":"#REF!"},{"$error":"#REF!"},{"$error":"#REF!"},{"$error":"#REF!"},{"$error":"#REF!"},{"$error":"#REF!"}]
[null,null,"00:00:00",{"$error":"#REF!"},{"$error":"#REF!"},{"$error":"#REF!"},{"$error":"#REF!"},{"$error":"#REF!"},{"$error":"#REF!"},{"$error":"#REF!"},{"$error":"#REF!"},{"$error":"#REF!"},{"$error":"#REF!"},{"$error":"#REF!"}]
[null,null,"00:00:00",{"$error":"#REF!"},{"$error":"#REF!"},{"$error":"#REF!"},{"$error":"#REF!"},{"$error":"#REF!"},{"$error":"#REF!"},{"$error":"#REF!"},{"$error":"#REF!"},{"$error":"#REF!"},{"$error":"#REF!"},{"$error":"#REF!"}]
[null,null,"00:00:00",{"$error":"#REF!"},{"$error":"#REF!"},{"$error":"#REF!"},{"$error":"#REF!"},{"$error":"#REF!"},{"$error":"#REF!"},{"$error":"#REF!"},{"$error":"#REF!"},{"$error":"#REF!"},{"$error":"#REF!"},{"$error":"#REF!"}]
[null,null,"00:00:00",{"$error":"#REF!"},{"$error":"#REF!"},{"$error":"#REF!"},{"$error":"#REF!"},{"$error":"#REF!"},{"$error":"#REF!"},{"$error":"#REF!"},{"$error":"#REF!"},{"$error":"#REF!"},{"$error":"#REF!"},{"$error":"#REF!"}]
[null,null,"00:00:00",{"$error":"#REF!"},{"$error":"#REF!"},{"$error":"#REF!"},{"$error":"#REF!"},{"$error":"#REF!"},{"$error":"#REF!"},{"$error":"#REF!"},{"$error":"#REF!"},{"$error":"#REF!"},{"$error":"#REF!"},{"$error":"#REF!"}]
[null,null,"00:00:00",{"$error":"#REF!"},{"$error":"#REF!"},{"$error":"#REF!"},{"$error":"#REF!"},{"$error":"#REF!"},{"$error":"#REF!"},{"$error":"#REF!"},{"$error":"#REF!"},{"$error":"#REF!"},{"$error":"#REF!"},{"$error":"#REF!"}]
[null,null,"00:00:00",{"$error":"#REF!"},{"$error":"#REF!"},{"$error":"#REF!"},{"$error":"#REF!"},{"$error":"#REF!"},{"$error":"#REF!"},{"$error":"#REF!"},{"$error":"#REF!"},{"$error":"#REF!"},{"$error":"#REF!"},{"$error":"#REF!"}]
[null,null,"00:00:00",{"$error":"#REF!"},{"$error":"#REF!"},{"$error":"#REF!"},{"$error":"#REF!"},{"$error":"#REF!"},{"$error":"#REF!"},{"$error":"#REF!"},{"$error":"#REF!"},{"$error":"#REF!"},{"$error":"#REF!"},{"$error":"#REF!"}]
[null,null,"00:00:00",{"$error":"#REF!"},{"$error":"#REF!"},{"$error":"#REF!"},{"$error":"#REF!"},{"$error":"#REF!"},{"$error":"#REF!"},{"$error":"#REF!"},{"$error":"#REF!"},{"$error":"#REF!"},{"$error":"#REF!"},{"$error":"#REF!"}]
[null,null,"00:00:00",{"$error":"#REF!"},{"$error":"#REF!"},{"$error":"#REF!"},{"$error":"#REF!"},{"$error":"#REF!"},{"$error":"#REF!"},{"$error":"#REF!"},{"$error":"#REF!"},{"$error":"#REF!"},{"$error":"#REF!"},{"$error":"#REF!"}]
[null,null,"00:00:00",{"$error":"#REF!"},{"$error":"#REF!"},{"$error":"#REF!"},{"$error":"#REF!"},{"$error":"#REF!"},{"$error":"#REF!"},{"$error":"#REF!"},{"$error":"#REF!"},{"$error":"#REF!"},{"$error":"#REF!"},{"$error":"#REF!"}]
[null,null,"00:00:00",{"$error":"#REF!"},{"$error":"#REF!"},{"$error":"#REF!"},{"$error":"#REF!"},{"$error":"#REF!"},{"$error":"#REF!"},{"$error":"#REF!"},{"$error":"#REF!"},{"$error":"#REF!"},{"$error":"#REF!"},{"$error":"#REF!"}]
[null,null,"00:00:00",{"$error":"#REF!"},{"$error":"#REF!"},{"$error":"#REF!"},{"$error":"#REF!"},{"$error":"#REF!"},{"$error":"#REF!"},{"$error":"#REF!"},{"$error":"#REF!"},{"$error":"#REF!"},{"$error":"#REF!"},{"$error":"#REF!"}]
[null,null,"00:00:00",{"$error":"#REF!"},{"$error":"#REF!"},{"$error":"#REF!"},{"$error":"#REF!"},{"$error":"#REF!"},{"$error":"#REF!"},{"$error":"#REF!"},{"$error":"#REF!"},{"$error":"#REF!"},{"$error":"#REF!"},{"$error":"#REF!"}]
[null,null,"00:00:00",{"$error":"#REF!"},{"$error":"#REF!"},{"$error":"#REF!"},{"$error":"#REF!"},{"$error":"#REF!"},{"$error":"#REF!"},{"$error":"#REF!"},{"$error":"#REF!"},{"$error":"#REF!"},{"$error":"#REF!"},{"$error":"#REF!"}]
[null,null,"00:00:00",{"$error":"#REF!"},{"$error":"#REF!"},{"$error":"#REF!"},{"$error":"#REF!"},{"$error":"#REF!"},{"$error":"#REF!"},{"$error":"#REF!"},{"$error":"#REF!"},{"$error":"#REF!"},{"$error":"#REF!"},{"$error":"#REF!"}]
[null,null,"00:00:00",{"$error":"#REF!"},{"$error":"#REF!"},{"$error":"#REF!"},{"$error":"#REF!"},{"$error":"#REF!"},{"$error":"#REF!"},{"$error":"#REF!"},{"$error":"#REF!"},{"$error":"#REF!"},{"$error":"#REF!"},{"$error":"#REF!"}]
[null,null,"00:00:00",{"$error":"#REF!"},{"$error":"#REF!"},{"$error":"#REF!"},{"$error":"#REF!"},{"$error":"#REF!"},{"$error":"#REF!"},{"$error":"#REF!"},{"$error":"#REF!"},{"$error":"#REF!"},{"$error":"#REF!"},{"$error":"#REF!"}]
[null,null,"00:00:00",{"$error":"#REF!"},{"$error":"#REF!"},{"$error":"#REF!"},{"$error":"#REF!"},{"$error":"#REF!"},{"$error":"#REF!"},{"$error":"#REF!"},{"$error":"#REF!"},{"$error":"#REF!"},{"$error":"#REF!"},{"$error":"#REF!"}]
[null,null,"00:00:00",{"$error":"#REF!"},{"$error":"#REF!"},{"$error":"#REF!"},{"$error":"#REF!"},{"$error":"#REF!"},{"$error":"#REF!"},{"$error":"#REF!"},{"$error":"#REF!"},{"$error":"#REF!"},{"$error":"#REF!"},{"$error":"#REF!"}]
[null,null,"00:00:00",{"$error":"#REF!"},{"$error":"#REF!"},{"$error":"#REF!"},{"$error":"#REF!"},{"$error":"#REF!"},{"$error":"#REF!"},{"$error":"#REF!"},{"$error":"#REF!"},{"$error":"#REF!"},{"$error":"#REF!"},{"$error":"#REF!"}]
[null,null,"00:00:00",{"$error":"#REF!"},{"$error":"#REF!"},{"$error":"#REF!"},{"$error":"#REF!"},{"$error":"#REF!"},{"$error":"#REF!"},{"$error":"#REF!"},{"$error":"#REF!"},{"$error":"#REF!"},{"$error":"#REF!"},{"$error":"#REF!"}]
[null,null,"00:00:00",{"$error":"#REF!"},{"$error":"#REF!"},{"$error":"#REF!"},{"$error":"#REF!"},{"$error":"#REF!"},{"$error":"#REF!"},{"$error":"#REF!"},{"$error":"#REF!"},{"$error":"#REF!"},{"$error":"#REF!"},{"$error":"#REF!"}]
[null,null,"00:00:00",{"$error":"#REF!"},{"$error":"#REF!"},{"$error":"#REF!"},{"$error":"#REF!"},{"$error":"#REF!"},{"$error":"#REF!"},{"$error":"#REF!"},{"$error":"#REF!"},{"$error":"#REF!"},{"$error":"#REF!"},{"$error":"#REF!"}]
[null,null,"00:00:00",{"$error":"#REF!"},{"$error":"#REF!"},{"$error":"#REF!"},{"$error":"#REF!"},{"$error":"#REF!"},{"$error":"#REF!"},{"$error":"#REF!"},{"$error":"#REF!"},{"$error":"#REF!"},{"$error":"#REF!"},{"$error":"#REF!"}]
[null,null,"00:00:00",{"$error":"#REF!"},{"$error":"#REF!"},{"$error":"#REF!"},{"$error":"#REF!"},{"$error":"#REF!"},{"$error":"#REF!"},{"$error":"#REF!"},{"$error":"#REF!"},{"$error":"#REF!"},{"$error":"#REF!"},{"$error":"#REF!"}]
[null,null,"00:00:00",{"$error":"#REF!"},{"$error":"#REF!"},{"$error":"#REF!"},{"$error":"#REF!"},{"$error":"#REF!"},{"$error":"#REF!"},{"$error":"#REF!"},{"$error":"#REF!"},{"$error":"#REF!"},{"$error":"#REF!"},{"$error":"#REF!"}]
[null,null,"00:00:00",{"$error":"#REF!"},{"$error":"#REF!"},{"$error":"#REF!"},{"$error":"#REF!"},{"$error":"#REF!"},{"$error":"#REF!"},{"$error":"#REF!"},{"$error":"#REF!"},{"$error":"#REF!"},{"$error":"#REF!"},{"$error":"#REF!"}]
[null,null,"00:00:00",{"$error":"#REF!"},{"$error":"#REF!"},{"$error":"#REF!"},{"$error":"#REF!"},{"$error":"#REF!"},{"$error":"#REF!"},{"$error":"#REF!"},{"$error":"#REF!"},{"$error":"#REF!"},{"$error":"#REF!"},{"$error":"#REF!"}]
[null,null,"00:00:00",{"$error":"#REF!"},{"$error":"#REF!"},{"$error":"#REF!"},{"$error":"#REF!"},{"$error":"#REF!"},{"$error":"#REF!"},{"$error":"#REF!"},{"$error":"#REF!"},{"$error":"#REF!"},{"$error":"#REF!"},{"$error":"#REF!"}]
[null,null,"00:00:00",{"$error":"#REF!"},{"$error":"#REF!"},{"$error":"#REF!"},{"$error":"#REF!"},{"$error":"#REF!"},{"$error":"#REF!"},{"$error":"#REF!"},{"$error":"#REF!"},{"$error":"#REF!"},{"$error":"#REF!"},{"$error":"#REF!"}]
[null,null,"00:00:00",{"$error":"#REF!"},{"$error":"#REF!"},{"$error":"#REF!"},{"$error":"#REF!"},{"$error":"#REF!"},{"$error":"#REF!"},{"$error":"#REF!"},{"$error":"#REF!"},{"$error":"#REF!"},{"$error":"#REF!"},{"$error":"#REF!"}]
[null,null,"00:00:00",{"$error":"#REF!"},{"$error":"#REF!"},{"$error":"#REF!"},{"$error":"#REF!"},{"$error":"#REF!"},{"$error":"#REF!"},{"$error":"#REF!"},{"$error":"#REF!"},{"$error":"#REF!"},{"$error":"#REF!"},{"$error":"#REF!"}]
[null,null,"00:00:00",{"$error":"#REF!"},{"$error":"#REF!"},{"$error":"#REF!"},{"$error":"#REF!"},{"$error":"#REF!"},{"$error":"#REF!"},{"$error":"#REF!"},{"$error":"#REF!"},{"$error":"#REF!"},{"$error":"#REF!"},{"$error":"#REF!"}]
[null,null,"00:00:00",{"$error":"#REF!"},{"$error":"#REF!"},{"$error":"#REF!"},{"$error":"#REF!"},{"$error":"#REF!"},{"$error":"#REF!"},{"$error":"#REF!"},{"$error":"#REF!"},{"$error":"#REF!"},{"$error":"#REF!"},{"$error":"#REF!"}]
[null,null,"00:00:00",{"$error":"#REF!"},{"$error":"#REF!"},{"$error":"#REF!"},{"$error":"#REF!"},{"$error":"#REF!"},{"$error":"#REF!"},{"$error":"#REF!"},{"$error":"#REF!"},{"$error":"#REF!"},{"$error":"#REF!"},{"$error":"#REF!"}]
[null,null,"00:00:00",{"$error":"#REF!"},{"$error":"#REF!"},{"$error":"#REF!"},{"$error":"#REF!"},{"$error":"#REF!"},{"$error":"#REF!"},{"$error":"#REF!"},{"$error":"#REF!"},{"$error":"#REF!"},{"$error":"#REF!"},{"$error":"#REF!"}]
[null,null,"00:00:00",{"$error":"#REF!"},{"$error":"#REF!"},{"$error":"#REF!"},{"$error":"#REF!"},{"$error":"#REF!"},{"$error":"#REF!"},{"$error":"#REF!"},{"$error":"#REF!"},{"$error":"#REF!"},{"$error":"#REF!"},{"$error":"#REF!"}]
[null,null,"00:00:00",{"$error":"#REF!"},{"$error":"#REF!"},{"$error":"#REF!"},{"$error":"#REF!"},{"$error":"#REF!"},{"$error":"#REF!"},{"$error":"#REF!"},{"$error":"#REF!"},{"$error":"#REF!"},{"$error":"#REF!"},{"$error":"#REF!"}]
[null,null,"00:00:00",{"$error":"#REF!"},{"$error":"#REF!"},{"$error":"#REF!"},{"$error":"#REF!"},{"$error":"#REF!"},{"$error":"#REF!"},{"$error":"#REF!"},{"$error":"#REF!"},{"$error":"#REF!"},{"$error":"#REF!"},{"$error":"#REF!"}]
[null,null,"00:00:00",{"$error":"#REF!"},{"$error":"#REF!"},{"$error":"#REF!"},{"$error":"#REF!"},{"$error":"#REF!"},{"$error":"#REF!"},{"$error":"#REF!"},{"$error":"#REF!"},{"$error":"#REF!"},{"$error":"#REF!"},{"$error":"#REF!"}]
[null,null,"00:00:00",{"$f":"$G$49","v":{"$error":"#REF!"}},{"$error":"#REF!"},{"$error":"#REF!"},{"$error":"#REF!"},{"$error":"#REF!"},{"$error":"#REF!"},{"$error":"#REF!"},{"$error":"#REF!"},{"$error":"#REF!"},{"$error":"#REF!"},{"$error":"#REF!"}]
[null,null,{"$f":"B802","v":"00:00:00"},{"$error":"#REF!"},{"$error":"#REF!"},{"$f":"+$C$80+$H$80","v":{"$error":"#REF!"}},{"$f":"+$C$78+$H$78","v":{"$error":"#REF!"}},{"$f":"+$C$76+$C$84","v":{"$error":"#REF!"}},{"$f":"D802-E802-F802-G802-H802","v":{"$error":"#REF!"}},{"$error":"#REF!"},{"$error":"#REF!"},{"$error":"#REF!"},{"$error":"#REF!"},{"$f":"M802-K802","v":{"$error":"#REF!"}}]
[null,null,"00:00:00",{"$error":"#REF!"},{"$f":"+$C$82+$H$82","v":{"$error":"#REF!"}},{"$error":"#REF!"},{"$error":"#REF!"},{"$error":"#REF!"},{"$error":"#REF!"},{"$error":"#REF!"},{"$error":"#REF!"},{"$f":"M802+I803","v":{"$error":"#REF!"}},{"$f":"L803*(1+$C$44)","v":{"$error":"#REF!"}},{"$error":"#REF!"}]
[null,null,"00:00:00",{"$error":"#REF!"},{"$error":"#REF!"},{"$error":"#REF!"},{"$error":"#REF!"},{"$error":"#REF!"},{"$error":"#REF!"},{"$f":"+K803+I804","v":{"$error":"#REF!"}},{"$error":"#REF!"},{"$error":"#REF!"},{"$error":"#REF!"},{"$error":"#REF!"}]
[null,null,"00:00:00",{"$error":"#REF!"},{"$error":"#REF!"},{"$error":"#REF!"},{"$error":"#REF!"},{"$error":"#REF!"},{"$error":"#REF!"},{"$error":"#REF!"},{"$f":"+(1+$C$42)*J805","v":{"$error":"#REF!"}},{"$error":"#REF!"},{"$error":"#REF!"},{"$error":"#REF!"}]
[null,null,"00:00:00",{"$error":"#REF!"},{"$error":"#REF!"},{"$error":"#REF!"},{"$error":"#REF!"},{"$error":"#REF!"},{"$error":"#REF!"},{"$error":"#REF!"},{"$error":"#REF!"},{"$error":"#REF!"},{"$error":"#REF!"},{"$error":"#REF!"}]
[null,null,"00:00:00",{"$error":"#REF!"},{"$error":"#REF!"},{"$error":"#REF!"},{"$error":"#REF!"},{"$error":"#REF!"},{"$error":"#REF!"},{"$error":"#REF!"},{"$error":"#REF!"},{"$error":"#REF!"},{"$error":"#REF!"},{"$error":"#REF!"}]
[null,null,"00:00:00",{"$error":"#REF!"},{"$error":"#REF!"},{"$error":"#REF!"},{"$error":"#REF!"},{"$error":"#REF!"},{"$error":"#REF!"},{"$error":"#REF!"},{"$error":"#REF!"},{"$error":"#REF!"},{"$error":"#REF!"},{"$error":"#REF!"}]
[null,null,"00:00:00",{"$error":"#REF!"},{"$error":"#REF!"},{"$error":"#REF!"},{"$error":"#REF!"},{"$error":"#REF!"},{"$error":"#REF!"},{"$error":"#REF!"},{"$error":"#REF!"},{"$error":"#REF!"},{"$error":"#REF!"},{"$error":"#REF!"}]
[null,null,"00:00:00",{"$error":"#REF!"},{"$error":"#REF!"},{"$error":"#REF!"},{"$error":"#REF!"},{"$error":"#REF!"},{"$error":"#REF!"},{"$error":"#REF!"},{"$error":"#REF!"},{"$error":"#REF!"},{"$error":"#REF!"},{"$error":"#REF!"}]
[null,null,"00:00:00",{"$error":"#REF!"},{"$error":"#REF!"},{"$error":"#REF!"},{"$error":"#REF!"},{"$error":"#REF!"},{"$error":"#REF!"},{"$error":"#REF!"},{"$error":"#REF!"},{"$error":"#REF!"},{"$error":"#REF!"},{"$error":"#REF!"}]
[null,null,"00:00:00",{"$error":"#REF!"},{"$error":"#REF!"},{"$error":"#REF!"},{"$error":"#REF!"},{"$error":"#REF!"},{"$error":"#REF!"},{"$error":"#REF!"},{"$error":"#REF!"},{"$error":"#REF!"},{"$error":"#REF!"},{"$error":"#REF!"}]
[null,null,"00:00:00",{"$error":"#REF!"},{"$error":"#REF!"},{"$error":"#REF!"},{"$error":"#REF!"},{"$error":"#REF!"},{"$error":"#REF!"},{"$error":"#REF!"},{"$error":"#REF!"},{"$error":"#REF!"},{"$error":"#REF!"},{"$error":"#REF!"}]
[null,null,"00:00:00",{"$error":"#REF!"},{"$error":"#REF!"},{"$error":"#REF!"},{"$error":"#REF!"},{"$error":"#REF!"},{"$error":"#REF!"},{"$error":"#REF!"},{"$error":"#REF!"},{"$error":"#REF!"},{"$error":"#REF!"},{"$error":"#REF!"}]
[null,null,"00:00:00",{"$error":"#REF!"},{"$error":"#REF!"},{"$error":"#REF!"},{"$error":"#REF!"},{"$error":"#REF!"},{"$error":"#REF!"},{"$error":"#REF!"},{"$error":"#REF!"},{"$error":"#REF!"},{"$error":"#REF!"},{"$error":"#REF!"}]
[null,null,"00:00:00",{"$error":"#REF!"},{"$error":"#REF!"},{"$error":"#REF!"},{"$error":"#REF!"},{"$error":"#REF!"},{"$error":"#REF!"},{"$error":"#REF!"},{"$error":"#REF!"},{"$error":"#REF!"},{"$error":"#REF!"},{"$error":"#REF!"}]
[null,null,"00:00:00",{"$error":"#REF!"},{"$error":"#REF!"},{"$error":"#REF!"},{"$error":"#REF!"},{"$error":"#REF!"},{"$error":"#REF!"},{"$error":"#REF!"},{"$error":"#REF!"},{"$error":"#REF!"},{"$error":"#REF!"},{"$error":"#REF!"}]
[null,null,"00:00:00",{"$error":"#REF!"},{"$error":"#REF!"},{"$error":"#REF!"},{"$error":"#REF!"},{"$error":"#REF!"},{"$error":"#REF!"},{"$error":"#REF!"},{"$error":"#REF!"},{"$error":"#REF!"},{"$error":"#REF!"},{"$error":"#REF!"}]
[null,null,"00:00:00",{"$error":"#REF!"},{"$error":"#REF!"},{"$error":"#REF!"},{"$error":"#REF!"},{"$error":"#REF!"},{"$error":"#REF!"},{"$error":"#REF!"},{"$error":"#REF!"},{"$error":"#REF!"},{"$error":"#REF!"},{"$error":"#REF!"}]
[null,null,"00:00:00",{"$error":"#REF!"},{"$error":"#REF!"},{"$error":"#REF!"},{"$error":"#REF!"},{"$error":"#REF!"},{"$error":"#REF!"},{"$error":"#REF!"},{"$error":"#REF!"},{"$error":"#REF!"},{"$error":"#REF!"},{"$error":"#REF!"}]
[null,null,"00:00:00",{"$error":"#REF!"},{"$error":"#REF!"},{"$error":"#REF!"},{"$error":"#REF!"},{"$error":"#REF!"},{"$error":"#REF!"},{"$error":"#REF!"},{"$error":"#REF!"},{"$error":"#REF!"},{"$error":"#REF!"},{"$error":"#REF!"}]
[null,null,"00:00:00",{"$error":"#REF!"},{"$error":"#REF!"},{"$error":"#REF!"},{"$error":"#REF!"},{"$error":"#REF!"},{"$error":"#REF!"},{"$error":"#REF!"},{"$error":"#REF!"},{"$error":"#REF!"},{"$error":"#REF!"},{"$error":"#REF!"}]
[null,null,"00:00:00",{"$error":"#REF!"},{"$error":"#REF!"},{"$error":"#REF!"},{"$error":"#REF!"},{"$error":"#REF!"},{"$error":"#REF!"},{"$error":"#REF!"},{"$error":"#REF!"},{"$error":"#REF!"},{"$error":"#REF!"},{"$error":"#REF!"}]
[null,null,"00:00:00",{"$error":"#REF!"},{"$error":"#REF!"},{"$error":"#REF!"},{"$error":"#REF!"},{"$error":"#REF!"},{"$error":"#REF!"},{"$error":"#REF!"},{"$error":"#REF!"},{"$error":"#REF!"},{"$error":"#REF!"},{"$error":"#REF!"}]
[null,null,"00:00:00",{"$error":"#REF!"},{"$error":"#REF!"},{"$error":"#REF!"},{"$error":"#REF!"},{"$error":"#REF!"},{"$error":"#REF!"},{"$error":"#REF!"},{"$error":"#REF!"},{"$error":"#REF!"},{"$error":"#REF!"},{"$error":"#REF!"}]
[null,null,"00:00:00",{"$error":"#REF!"},{"$error":"#REF!"},{"$error":"#REF!"},{"$error":"#REF!"},{"$error":"#REF!"},{"$error":"#REF!"},{"$error":"#REF!"},{"$error":"#REF!"},{"$error":"#REF!"},{"$error":"#REF!"},{"$error":"#REF!"}]
[null,null,"00:00:00",{"$error":"#REF!"},{"$error":"#REF!"},{"$error":"#REF!"},{"$error":"#REF!"},{"$error":"#REF!"},{"$error":"#REF!"},{"$error":"#REF!"},{"$error":"#REF!"},{"$error":"#REF!"},{"$error":"#REF!"},{"$error":"#REF!"}]
[null,null,"00:00:00",{"$error":"#REF!"},{"$error":"#REF!"},{"$error":"#REF!"},{"$error":"#REF!"},{"$error":"#REF!"},{"$error":"#REF!"},{"$error":"#REF!"},{"$error":"#REF!"},{"$error":"#REF!"},{"$error":"#REF!"},{"$error":"#REF!"}]
[null,null,"00:00:00",{"$error":"#REF!"},{"$error":"#REF!"},{"$error":"#REF!"},{"$error":"#REF!"},{"$error":"#REF!"},{"$error":"#REF!"},{"$error":"#REF!"},{"$error":"#REF!"},{"$error":"#REF!"},{"$error":"#REF!"},{"$error":"#REF!"}]
[null,null,"00:00:00",{"$error":"#REF!"},{"$error":"#REF!"},{"$error":"#REF!"},{"$error":"#REF!"},{"$error":"#REF!"},{"$error":"#REF!"},{"$error":"#REF!"},{"$error":"#REF!"},{"$error":"#REF!"},{"$error":"#REF!"},{"$error":"#REF!"}]
[null,null,"00:00:00",{"$error":"#REF!"},{"$error":"#REF!"},{"$error":"#REF!"},{"$error":"#REF!"},{"$error":"#REF!"},{"$error":"#REF!"},{"$error":"#REF!"},{"$error":"#REF!"},{"$error":"#REF!"},{"$error":"#REF!"},{"$error":"#REF!"}]
[null,null,"00:00:00",{"$error":"#REF!"},{"$error":"#REF!"},{"$error":"#REF!"},{"$error":"#REF!"},{"$error":"#REF!"},{"$error":"#REF!"},{"$error":"#REF!"},{"$error":"#REF!"},{"$error":"#REF!"},{"$error":"#REF!"},{"$error":"#REF!"}]
[null,null,"00:00:00",{"$error":"#REF!"},{"$error":"#REF!"},{"$error":"#REF!"},{"$error":"#REF!"},{"$error":"#REF!"},{"$error":"#REF!"},{"$error":"#REF!"},{"$error":"#REF!"},{"$error":"#REF!"},{"$error":"#REF!"},{"$error":"#REF!"}]
[null,null,"00:00:00",{"$error":"#REF!"},{"$error":"#REF!"},{"$error":"#REF!"},{"$error":"#REF!"},{"$error":"#REF!"},{"$error":"#REF!"},{"$error":"#REF!"},{"$error":"#REF!"},{"$error":"#REF!"},{"$error":"#REF!"},{"$error":"#REF!"}]
[null,null,"00:00:00",{"$error":"#REF!"},{"$error":"#REF!"},{"$error":"#REF!"},{"$error":"#REF!"},{"$error":"#REF!"},{"$error":"#REF!"},{"$error":"#REF!"},{"$error":"#REF!"},{"$error":"#REF!"},{"$error":"#REF!"},{"$error":"#REF!"}]
[null,null,"00:00:00",{"$error":"#REF!"},{"$error":"#REF!"},{"$error":"#REF!"},{"$error":"#REF!"},{"$error":"#REF!"},{"$error":"#REF!"},{"$error":"#REF!"},{"$error":"#REF!"},{"$error":"#REF!"},{"$error":"#REF!"},{"$error":"#REF!"}]
[null,null,"00:00:00",{"$error":"#REF!"},{"$error":"#REF!"},{"$error":"#REF!"},{"$error":"#REF!"},{"$error":"#REF!"},{"$error":"#REF!"},{"$error":"#REF!"},{"$error":"#REF!"},{"$error":"#REF!"},{"$error":"#REF!"},{"$error":"#REF!"}]
[null,null,"00:00:00",{"$error":"#REF!"},{"$error":"#REF!"},{"$error":"#REF!"},{"$error":"#REF!"},{"$error":"#REF!"},{"$error":"#REF!"},{"$error":"#REF!"},{"$error":"#REF!"},{"$error":"#REF!"},{"$error":"#REF!"},{"$error":"#REF!"}]
[null,null,"00:00:00",{"$error":"#REF!"},{"$error":"#REF!"},{"$error":"#REF!"},{"$error":"#REF!"},{"$error":"#REF!"},{"$error":"#REF!"},{"$error":"#REF!"},{"$error":"#REF!"},{"$error":"#REF!"},{"$error":"#REF!"},{"$error":"#REF!"}]
[null,null,"00:00:00",{"$error":"#REF!"},{"$error":"#REF!"},{"$error":"#REF!"},{"$error":"#REF!"},{"$error":"#REF!"},{"$error":"#REF!"},{"$error":"#REF!"},{"$error":"#REF!"},{"$error":"#REF!"},{"$error":"#REF!"},{"$error":"#REF!"}]
[null,null,"00:00:00",{"$error":"#REF!"},{"$error":"#REF!"},{"$error":"#REF!"},{"$error":"#REF!"},{"$error":"#REF!"},{"$error":"#REF!"},{"$error":"#REF!"},{"$error":"#REF!"},{"$error":"#REF!"},{"$error":"#REF!"},{"$error":"#REF!"}]
[null,null,"00:00:00",{"$error":"#REF!"},{"$error":"#REF!"},{"$error":"#REF!"},{"$error":"#REF!"},{"$error":"#REF!"},{"$error":"#REF!"},{"$error":"#REF!"},{"$error":"#REF!"},{"$error":"#REF!"},{"$error":"#REF!"},{"$error":"#REF!"}]
[null,null,"00:00:00",{"$error":"#REF!"},{"$error":"#REF!"},{"$error":"#REF!"},{"$error":"#REF!"},{"$error":"#REF!"},{"$error":"#REF!"},{"$error":"#REF!"},{"$error":"#REF!"},{"$error":"#REF!"},{"$error":"#REF!"},{"$error":"#REF!"}]
[null,null,"00:00:00",{"$error":"#REF!"},{"$error":"#REF!"},{"$error":"#REF!"},{"$error":"#REF!"},{"$error":"#REF!"},{"$error":"#REF!"},{"$error":"#REF!"},{"$error":"#REF!"},{"$error":"#REF!"},{"$error":"#REF!"},{"$error":"#REF!"}]
[null,null,"00:00:00",{"$error":"#REF!"},{"$error":"#REF!"},{"$error":"#REF!"},{"$error":"#REF!"},{"$error":"#REF!"},{"$error":"#REF!"},{"$error":"#REF!"},{"$error":"#REF!"},{"$error":"#REF!"},{"$error":"#REF!"},{"$error":"#REF!"}]
[null,null,"00:00:00",{"$error":"#REF!"},{"$error":"#REF!"},{"$error":"#REF!"},{"$error":"#REF!"},{"$error":"#REF!"},{"$error":"#REF!"},{"$error":"#REF!"},{"$error":"#REF!"},{"$error":"#REF!"},{"$error":"#REF!"},{"$error":"#REF!"}]
[null,null,"00:00:00",{"$error":"#REF!"},{"$error":"#REF!"},{"$error":"#REF!"},{"$error":"#REF!"},{"$error":"#REF!"},{"$error":"#REF!"},{"$error":"#REF!"},{"$error":"#REF!"},{"$error":"#REF!"},{"$error":"#REF!"},{"$error":"#REF!"}]
[null,null,"00:00:00",{"$error":"#REF!"},{"$error":"#REF!"},{"$error":"#REF!"},{"$error":"#REF!"},{"$error":"#REF!"},{"$error":"#REF!"},{"$error":"#REF!"},{"$error":"#REF!"},{"$error":"#REF!"},{"$error":"#REF!"},{"$error":"#REF!"}]
[null,null,"00:00:00",{"$error":"#REF!"},{"$error":"#REF!"},{"$error":"#REF!"},{"$error":"#REF!"},{"$error":"#REF!"},{"$error":"#REF!"},{"$error":"#REF!"},{"$error":"#REF!"},{"$error":"#REF!"},{"$error":"#REF!"},{"$error":"#REF!"}]
[null,null,"00:00:00",{"$error":"#REF!"},{"$error":"#REF!"},{"$error":"#REF!"},{"$error":"#REF!"},{"$error":"#REF!"},{"$error":"#REF!"},{"$error":"#REF!"},{"$error":"#REF!"},{"$error":"#REF!"},{"$error":"#REF!"},{"$error":"#REF!"}]
[null,null,"00:00:00",{"$error":"#REF!"},{"$error":"#REF!"},{"$error":"#REF!"},{"$error":"#REF!"},{"$error":"#REF!"},{"$error":"#REF!"},{"$error":"#REF!"},{"$error":"#REF!"},{"$error":"#REF!"},{"$error":"#REF!"},{"$error":"#REF!"}]
[null,null,"00:00:00",{"$error":"#REF!"},{"$error":"#REF!"},{"$error":"#REF!"},{"$error":"#REF!"},{"$error":"#REF!"},{"$error":"#REF!"},{"$error":"#REF!"},{"$error":"#REF!"},{"$error":"#REF!"},{"$error":"#REF!"},{"$error":"#REF!"}]
[null,null,"00:00:00",{"$error":"#REF!"},{"$error":"#REF!"},{"$error":"#REF!"},{"$error":"#REF!"},{"$error":"#REF!"},{"$error":"#REF!"},{"$error":"#REF!"},{"$error":"#REF!"},{"$error":"#REF!"},{"$error":"#REF!"},{"$error":"#REF!"}]
[null,null,"00:00:00",{"$error":"#REF!"},{"$error":"#REF!"},{"$error":"#REF!"},{"$error":"#REF!"},{"$error":"#REF!"},{"$error":"#REF!"},{"$error":"#REF!"},{"$error":"#REF!"},{"$error":"#REF!"},{"$error":"#REF!"},{"$error":"#REF!"}]
[null,null,"00:00:00",{"$error":"#REF!"},{"$error":"#REF!"},{"$error":"#REF!"},{"$error":"#REF!"},{"$error":"#REF!"},{"$error":"#REF!"},{"$error":"#REF!"},{"$error":"#REF!"},{"$error":"#REF!"},{"$error":"#REF!"},{"$error":"#REF!"}]
[null,null,"00:00:00",{"$error":"#REF!"},{"$error":"#REF!"},{"$error":"#REF!"},{"$error":"#REF!"},{"$error":"#REF!"},{"$error":"#REF!"},{"$error":"#REF!"},{"$error":"#REF!"},{"$error":"#REF!"},{"$error":"#REF!"},{"$error":"#REF!"}]
[null,null,"00:00:00",{"$error":"#REF!"},{"$error":"#REF!"},{"$error":"#REF!"},{"$error":"#REF!"},{"$error":"#REF!"},{"$error":"#REF!"},{"$error":"#REF!"},{"$error":"#REF!"},{"$error":"#REF!"},{"$error":"#REF!"},{"$error":"#REF!"}]
[null,null,"00:00:00",{"$error":"#REF!"},{"$error":"#REF!"},{"$error":"#REF!"},{"$error":"#REF!"},{"$error":"#REF!"},{"$error":"#REF!"},{"$error":"#REF!"},{"$error":"#REF!"},{"$error":"#REF!"},{"$error":"#REF!"},{"$error":"#REF!"}]
[null,null,"00:00:00",{"$error":"#REF!"},{"$error":"#REF!"},{"$error":"#REF!"},{"$error":"#REF!"},{"$error":"#REF!"},{"$error":"#REF!"},{"$error":"#REF!"},{"$error":"#REF!"},{"$error":"#REF!"},{"$error":"#REF!"},{"$error":"#REF!"}]
[null,null,"00:00:00",{"$error":"#REF!"},{"$error":"#REF!"},{"$error":"#REF!"},{"$error":"#REF!"},{"$error":"#REF!"},{"$error":"#REF!"},{"$error":"#REF!"},{"$error":"#REF!"},{"$error":"#REF!"},{"$error":"#REF!"},{"$error":"#REF!"}]
[null,null,"00:00:00",{"$error":"#REF!"},{"$error":"#REF!"},{"$error":"#REF!"},{"$error":"#REF!"},{"$error":"#REF!"},{"$error":"#REF!"},{"$error":"#REF!"},{"$error":"#REF!"},{"$error":"#REF!"},{"$error":"#REF!"},{"$error":"#REF!"}]
[null,null,"00:00:00",{"$error":"#REF!"},{"$error":"#REF!"},{"$error":"#REF!"},{"$error":"#REF!"},{"$error":"#REF!"},{"$error":"#REF!"},{"$error":"#REF!"},{"$error":"#REF!"},{"$error":"#REF!"},{"$error":"#REF!"},{"$error":"#REF!"}]
[null,null,"00:00:00",{"$error":"#REF!"},{"$error":"#REF!"},{"$error":"#REF!"},{"$error":"#REF!"},{"$error":"#REF!"},{"$error":"#REF!"},{"$error":"#REF!"},{"$error":"#REF!"},{"$error":"#REF!"},{"$error":"#REF!"},{"$error":"#REF!"}]
[null,null,"00:00:00",{"$error":"#REF!"},{"$error":"#REF!"},{"$error":"#REF!"},{"$error":"#REF!"},{"$error":"#REF!"},{"$error":"#REF!"},{"$error":"#REF!"},{"$error":"#REF!"},{"$error":"#REF!"},{"$error":"#REF!"},{"$error":"#REF!"}]
[null,null,"00:00:00",{"$f":"$G$49","v":{"$error":"#REF!"}},{"$error":"#REF!"},{"$error":"#REF!"},{"$error":"#REF!"},{"$error":"#REF!"},{"$error":"#REF!"},{"$error":"#REF!"},{"$error":"#REF!"},{"$error":"#REF!"},{"$error":"#REF!"},{"$error":"#REF!"}]
[null,null,{"$f":"B866","v":"00:00:00"},{"$error":"#REF!"},{"$error":"#REF!"},{"$f":"+$C$80+$H$80","v":{"$error":"#REF!"}},{"$f":"+$C$78+$H$78","v":{"$error":"#REF!"}},{"$f":"+$C$76+$C$84","v":{"$error":"#REF!"}},{"$f":"D866-E866-F866-G866-H866","v":{"$error":"#REF!"}},{"$error":"#REF!"},{"$error":"#REF!"},{"$error":"#REF!"},{"$error":"#REF!"},{"$f":"M866-K866","v":{"$error":"#REF!"}}]
[null,null,"00:00:00",{"$error":"#REF!"},{"$f":"+$C$82+$H$82","v":{"$error":"#REF!"}},{"$error":"#REF!"},{"$error":"#REF!"},{"$error":"#REF!"},{"$error":"#REF!"},{"$error":"#REF!"},{"$error":"#REF!"},{"$f":"M866+I867","v":{"$error":"#REF!"}},{"$f":"L867*(1+$C$44)","v":{"$error":"#REF!"}},{"$error":"#REF!"}]
[null,null,"00:00:00",{"$error":"#REF!"},{"$error":"#REF!"},{"$error":"#REF!"},{"$error":"#REF!"},{"$error":"#REF!"},{"$error":"#REF!"},{"$f":"+K867+I868","v":{"$error":"#REF!"}},{"$error":"#REF!"},{"$error":"#REF!"},{"$error":"#REF!"},{"$error":"#REF!"}]
[null,null,"00:00:00",{"$error":"#REF!"},{"$error":"#REF!"},{"$error":"#REF!"},{"$error":"#REF!"},{"$error":"#REF!"},{"$error":"#REF!"},{"$error":"#REF!"},{"$f":"+(1+$C$42)*J869","v":{"$error":"#REF!"}},{"$error":"#REF!"},{"$error":"#REF!"},{"$error":"#REF!"}]
[null,null,"00:00:00",{"$error":"#REF!"},{"$error":"#REF!"},{"$error":"#REF!"},{"$error":"#REF!"},{"$error":"#REF!"},{"$error":"#REF!"},{"$error":"#REF!"},{"$error":"#REF!"},{"$error":"#REF!"},{"$error":"#REF!"},{"$error":"#REF!"}]
[null,null,"00:00:00",{"$error":"#REF!"},{"$error":"#REF!"},{"$error":"#REF!"},{"$error":"#REF!"},{"$error":"#REF!"},{"$error":"#REF!"},{"$error":"#REF!"},{"$error":"#REF!"},{"$error":"#REF!"},{"$error":"#REF!"},{"$error":"#REF!"}]
[null,null,"00:00:00",{"$error":"#REF!"},{"$error":"#REF!"},{"$error":"#REF!"},{"$error":"#REF!"},{"$error":"#REF!"},{"$error":"#REF!"},{"$error":"#REF!"},{"$error":"#REF!"},{"$error":"#REF!"},{"$error":"#REF!"},{"$error":"#REF!"}]
[null,null,"00:00:00",{"$error":"#REF!"},{"$error":"#REF!"},{"$error":"#REF!"},{"$error":"#REF!"},{"$error":"#REF!"},{"$error":"#REF!"},{"$error":"#REF!"},{"$error":"#REF!"},{"$error":"#REF!"},{"$error":"#REF!"},{"$error":"#REF!"}]
[null,null,"00:00:00",{"$error":"#REF!"},{"$error":"#REF!"},{"$error":"#REF!"},{"$error":"#REF!"},{"$error":"#REF!"},{"$error":"#REF!"},{"$error":"#REF!"},{"$error":"#REF!"},{"$error":"#REF!"},{"$error":"#REF!"},{"$error":"#REF!"}]
[null,null,"00:00:00",{"$error":"#REF!"},{"$error":"#REF!"},{"$error":"#REF!"},{"$error":"#REF!"},{"$error":"#REF!"},{"$error":"#REF!"},{"$error":"#REF!"},{"$error":"#REF!"},{"$error":"#REF!"},{"$error":"#REF!"},{"$error":"#REF!"}]
[null,null,"00:00:00",{"$error":"#REF!"},{"$error":"#REF!"},{"$error":"#REF!"},{"$error":"#REF!"},{"$error":"#REF!"},{"$error":"#REF!"},{"$error":"#REF!"},{"$error":"#REF!"},{"$error":"#REF!"},{"$error":"#REF!"},{"$error":"#REF!"}]
[null,null,"00:00:00",{"$error":"#REF!"},{"$error":"#REF!"},{"$error":"#REF!"},{"$error":"#REF!"},{"$error":"#REF!"},{"$error":"#REF!"},{"$error":"#REF!"},{"$error":"#REF!"},{"$error":"#REF!"},{"$error":"#REF!"},{"$error":"#REF!"}]
[null,null,"00:00:00",{"$error":"#REF!"},{"$error":"#REF!"},{"$error":"#REF!"},{"$error":"#REF!"},{"$error":"#REF!"},{"$error":"#REF!"},{"$error":"#REF!"},{"$error":"#REF!"},{"$error":"#REF!"},{"$error":"#REF!"},{"$error":"#REF!"}]
[null,null,"00:00:00",{"$error":"#REF!"},{"$error":"#REF!"},{"$error":"#REF!"},{"$error":"#REF!"},{"$error":"#REF!"},{"$error":"#REF!"},{"$error":"#REF!"},{"$error":"#REF!"},{"$error":"#REF!"},{"$error":"#REF!"},{"$error":"#REF!"}]
[null,null,"00:00:00",{"$error":"#REF!"},{"$error":"#REF!"},{"$error":"#REF!"},{"$error":"#REF!"},{"$error":"#REF!"},{"$error":"#REF!"},{"$error":"#REF!"},{"$error":"#REF!"},{"$error":"#REF!"},{"$error":"#REF!"},{"$error":"#REF!"}]
[null,null,"00:00:00",{"$error":"#REF!"},{"$error":"#REF!"},{"$error":"#REF!"},{"$error":"#REF!"},{"$error":"#REF!"},{"$error":"#REF!"},{"$error":"#REF!"},{"$error":"#REF!"},{"$error":"#REF!"},{"$error":"#REF!"},{"$error":"#REF!"}]
[null,null,"00:00:00",{"$error":"#REF!"},{"$error":"#REF!"},{"$error":"#REF!"},{"$error":"#REF!"},{"$error":"#REF!"},{"$error":"#REF!"},{"$error":"#REF!"},{"$error":"#REF!"},{"$error":"#REF!"},{"$error":"#REF!"},{"$error":"#REF!"}]
[null,null,"00:00:00",{"$error":"#REF!"},{"$error":"#REF!"},{"$error":"#REF!"},{"$error":"#REF!"},{"$error":"#REF!"},{"$error":"#REF!"},{"$error":"#REF!"},{"$error":"#REF!"},{"$error":"#REF!"},{"$error":"#REF!"},{"$error":"#REF!"}]
[null,null,"00:00:00",{"$error":"#REF!"},{"$error":"#REF!"},{"$error":"#REF!"},{"$error":"#REF!"},{"$error":"#REF!"},{"$error":"#REF!"},{"$error":"#REF!"},{"$error":"#REF!"},{"$error":"#REF!"},{"$error":"#REF!"},{"$error":"#REF!"}]
[null,null,"00:00:00",{"$error":"#REF!"},{"$error":"#REF!"},{"$error":"#REF!"},{"$error":"#REF!"},{"$error":"#REF!"},{"$error":"#REF!"},{"$error":"#REF!"},{"$error":"#REF!"},{"$error":"#REF!"},{"$error":"#REF!"},{"$error":"#REF!"}]
[null,null,"00:00:00",{"$error":"#REF!"},{"$error":"#REF!"},{"$error":"#REF!"},{"$error":"#REF!"},{"$error":"#REF!"},{"$error":"#REF!"},{"$error":"#REF!"},{"$error":"#REF!"},{"$error":"#REF!"},{"$error":"#REF!"},{"$error":"#REF!"}]
[null,null,"00:00:00",{"$error":"#REF!"},{"$error":"#REF!"},{"$error":"#REF!"},{"$error":"#REF!"},{"$error":"#REF!"},{"$error":"#REF!"},{"$error":"#REF!"},{"$error":"#REF!"},{"$error":"#REF!"},{"$error":"#REF!"},{"$error":"#REF!"}]
[null,null,"00:00:00",{"$error":"#REF!"},{"$error":"#REF!"},{"$error":"#REF!"},{"$error":"#REF!"},{"$error":"#REF!"},{"$error":"#REF!"},{"$error":"#REF!"},{"$error":"#REF!"},{"$error":"#REF!"},{"$error":"#REF!"},{"$error":"#REF!"}]
[null,null,"00:00:00",{"$error":"#REF!"},{"$error":"#REF!"},{"$error":"#REF!"},{"$error":"#REF!"},{"$error":"#REF!"},{"$error":"#REF!"},{"$error":"#REF!"},{"$error":"#REF!"},{"$error":"#REF!"},{"$error":"#REF!"},{"$error":"#REF!"}]
[null,null,"00:00:00",{"$error":"#REF!"},{"$error":"#REF!"},{"$error":"#REF!"},{"$error":"#REF!"},{"$error":"#REF!"},{"$error":"#REF!"},{"$error":"#REF!"},{"$error":"#REF!"},{"$error":"#REF!"},{"$error":"#REF!"},{"$error":"#REF!"}]
[null,null,"00:00:00",{"$error":"#REF!"},{"$error":"#REF!"},{"$error":"#REF!"},{"$error":"#REF!"},{"$error":"#REF!"},{"$error":"#REF!"},{"$error":"#REF!"},{"$error":"#REF!"},{"$error":"#REF!"},{"$error":"#REF!"},{"$error":"#REF!"}]
[null,null,"00:00:00",{"$error":"#REF!"},{"$error":"#REF!"},{"$error":"#REF!"},{"$error":"#REF!"},{"$error":"#REF!"},{"$error":"#REF!"},{"$error":"#REF!"},{"$error":"#REF!"},{"$error":"#REF!"},{"$error":"#REF!"},{"$error":"#REF!"}]
[null,null,"00:00:00",{"$error":"#REF!"},{"$error":"#REF!"},{"$error":"#REF!"},{"$error":"#REF!"},{"$error":"#REF!"},{"$error":"#REF!"},{"$error":"#REF!"},{"$error":"#REF!"},{"$error":"#REF!"},{"$error":"#REF!"},{"$error":"#REF!"}]
[null,null,"00:00:00",{"$error":"#REF!"},{"$error":"#REF!"},{"$error":"#REF!"},{"$error":"#REF!"},{"$error":"#REF!"},{"$error":"#REF!"},{"$error":"#REF!"},{"$error":"#REF!"},{"$error":"#REF!"},{"$error":"#REF!"},{"$error":"#REF!"}]
[null,null,"00:00:00",{"$error":"#REF!"},{"$error":"#REF!"},{"$error":"#REF!"},{"$error":"#REF!"},{"$error":"#REF!"},{"$error":"#REF!"},{"$error":"#REF!"},{"$error":"#REF!"},{"$error":"#REF!"},{"$error":"#REF!"},{"$error":"#REF!"}]
[null,null,"00:00:00",{"$error":"#REF!"},{"$error":"#REF!"},{"$error":"#REF!"},{"$error":"#REF!"},{"$error":"#REF!"},{"$error":"#REF!"},{"$error":"#REF!"},{"$error":"#REF!"},{"$error":"#REF!"},{"$error":"#REF!"},{"$error":"#REF!"}]
[null,null,"00:00:00",{"$error":"#REF!"},{"$error":"#REF!"},{"$error":"#REF!"},{"$error":"#REF!"},{"$error":"#REF!"},{"$error":"#REF!"},{"$error":"#REF!"},{"$error":"#REF!"},{"$error":"#REF!"},{"$error":"#REF!"},{"$error":"#REF!"}]
[null,null,"00:00:00",{"$error":"#REF!"},{"$error":"#REF!"},{"$error":"#REF!"},{"$error":"#REF!"},{"$error":"#REF!"},{"$error":"#REF!"},{"$error":"#REF!"},{"$error":"#REF!"},{"$error":"#REF!"},{"$error":"#REF!"},{"$error":"#REF!"}]
[null,null,"00:00:00",{"$error":"#REF!"},{"$error":"#REF!"},{"$error":"#REF!"},{"$error":"#REF!"},{"$error":"#REF!"},{"$error":"#REF!"},{"$error":"#REF!"},{"$error":"#REF!"},{"$error":"#REF!"},{"$error":"#REF!"},{"$error":"#REF!"}]
[null,null,"00:00:00",{"$error":"#REF!"},{"$error":"#REF!"},{"$error":"#REF!"},{"$error":"#REF!"},{"$error":"#REF!"},{"$error":"#REF!"},{"$error":"#REF!"},{"$error":"#REF!"},{"$error":"#REF!"},{"$error":"#REF!"},{"$error":"#REF!"}]
[null,null,"00:00:00",{"$error":"#REF!"},{"$error":"#REF!"},{"$error":"#REF!"},{"$error":"#REF!"},{"$error":"#REF!"},{"$error":"#REF!"},{"$error":"#REF!"},{"$error":"#REF!"},{"$error":"#REF!"},{"$error":"#REF!"},{"$error":"#REF!"}]
[null,null,"00:00:00",{"$error":"#REF!"},{"$error":"#REF!"},{"$error":"#REF!"},{"$error":"#REF!"},{"$error":"#REF!"},{"$error":"#REF!"},{"$error":"#REF!"},{"$error":"#REF!"},{"$error":"#REF!"},{"$error":"#REF!"},{"$error":"#REF!"}]
[null,null,"00:00:00",{"$error":"#REF!"},{"$error":"#REF!"},{"$error":"#REF!"},{"$error":"#REF!"},{"$error":"#REF!"},{"$error":"#REF!"},{"$error":"#REF!"},{"$error":"#REF!"},{"$error":"#REF!"},{"$error":"#REF!"},{"$error":"#REF!"}]
[null,null,"00:00:00",{"$error":"#REF!"},{"$error":"#REF!"},{"$error":"#REF!"},{"$error":"#REF!"},{"$error":"#REF!"},{"$error":"#REF!"},{"$error":"#REF!"},{"$error":"#REF!"},{"$error":"#REF!"},{"$error":"#REF!"},{"$error":"#REF!"}]
[null,null,"00:00:00",{"$error":"#REF!"},{"$error":"#REF!"},{"$error":"#REF!"},{"$error":"#REF!"},{"$error":"#REF!"},{"$error":"#REF!"},{"$error":"#REF!"},{"$error":"#REF!"},{"$error":"#REF!"},{"$error":"#REF!"},{"$error":"#REF!"}]
[null,null,"00:00:00",{"$error":"#REF!"},{"$error":"#REF!"},{"$error":"#REF!"},{"$error":"#REF!"},{"$error":"#REF!"},{"$error":"#REF!"},{"$error":"#REF!"},{"$error":"#REF!"},{"$error":"#REF!"},{"$error":"#REF!"},{"$error":"#REF!"}]
[null,null,"00:00:00",{"$error":"#REF!"},{"$error":"#REF!"},{"$error":"#REF!"},{"$error":"#REF!"},{"$error":"#REF!"},{"$error":"#REF!"},{"$error":"#REF!"},{"$error":"#REF!"},{"$error":"#REF!"},{"$error":"#REF!"},{"$error":"#REF!"}]
[null,null,"00:00:00",{"$error":"#REF!"},{"$error":"#REF!"},{"$error":"#REF!"},{"$error":"#REF!"},{"$error":"#REF!"},{"$error":"#REF!"},{"$error":"#REF!"},{"$error":"#REF!"},{"$error":"#REF!"},{"$error":"#REF!"},{"$error":"#REF!"}]
[null,null,"00:00:00",{"$error":"#REF!"},{"$error":"#REF!"},{"$error":"#REF!"},{"$error":"#REF!"},{"$error":"#REF!"},{"$error":"#REF!"},{"$error":"#REF!"},{"$error":"#REF!"},{"$error":"#REF!"},{"$error":"#REF!"},{"$error":"#REF!"}]
[null,null,"00:00:00",{"$error":"#REF!"},{"$error":"#REF!"},{"$error":"#REF!"},{"$error":"#REF!"},{"$error":"#REF!"},{"$error":"#REF!"},{"$error":"#REF!"},{"$error":"#REF!"},{"$error":"#REF!"},{"$error":"#REF!"},{"$error":"#REF!"}]
[null,null,"00:00:00",{"$error":"#REF!"},{"$error":"#REF!"},{"$error":"#REF!"},{"$error":"#REF!"},{"$error":"#REF!"},{"$error":"#REF!"},{"$error":"#REF!"},{"$error":"#REF!"},{"$error":"#REF!"},{"$error":"#REF!"},{"$error":"#REF!"}]
[null,null,"00:00:00",{"$error":"#REF!"},{"$error":"#REF!"},{"$error":"#REF!"},{"$error":"#REF!"},{"$error":"#REF!"},{"$error":"#REF!"},{"$error":"#REF!"},{"$error":"#REF!"},{"$error":"#REF!"},{"$error":"#REF!"},{"$error":"#REF!"}]
[null,null,"00:00:00",{"$error":"#REF!"},{"$error":"#REF!"},{"$error":"#REF!"},{"$error":"#REF!"},{"$error":"#REF!"},{"$error":"#REF!"},{"$error":"#REF!"},{"$error":"#REF!"},{"$error":"#REF!"},{"$error":"#REF!"},{"$error":"#REF!"}]
[null,null,"00:00:00",{"$error":"#REF!"},{"$error":"#REF!"},{"$error":"#REF!"},{"$error":"#REF!"},{"$error":"#REF!"},{"$error":"#REF!"},{"$error":"#REF!"},{"$error":"#REF!"},{"$error":"#REF!"},{"$error":"#REF!"},{"$error":"#REF!"}]
[null,null,"00:00:00",{"$error":"#REF!"},{"$error":"#REF!"},{"$error":"#REF!"},{"$error":"#REF!"},{"$error":"#REF!"},{"$error":"#REF!"},{"$error":"#REF!"},{"$error":"#REF!"},{"$error":"#REF!"},{"$error":"#REF!"},{"$error":"#REF!"}]
[null,null,"00:00:00",{"$error":"#REF!"},{"$error":"#REF!"},{"$error":"#REF!"},{"$error":"#REF!"},{"$error":"#REF!"},{"$error":"#REF!"},{"$error":"#REF!"},{"$error":"#REF!"},{"$error":"#REF!"},{"$error":"#REF!"},{"$error":"#REF!"}]
[null,null,"00:00:00",{"$error":"#REF!"},{"$error":"#REF!"},{"$error":"#REF!"},{"$error":"#REF!"},{"$error":"#REF!"},{"$error":"#REF!"},{"$error":"#REF!"},{"$error":"#REF!"},{"$error":"#REF!"},{"$error":"#REF!"},{"$error":"#REF!"}]
[null,null,"00:00:00",{"$error":"#REF!"},{"$error":"#REF!"},{"$error":"#REF!"},{"$error":"#REF!"},{"$error":"#REF!"},{"$error":"#REF!"},{"$error":"#REF!"},{"$error":"#REF!"},{"$error":"#REF!"},{"$error":"#REF!"},{"$error":"#REF!"}]
[null,null,"00:00:00",{"$error":"#REF!"},{"$error":"#REF!"},{"$error":"#REF!"},{"$error":"#REF!"},{"$error":"#REF!"},{"$error":"#REF!"},{"$error":"#REF!"},{"$error":"#REF!"},{"$error":"#REF!"},{"$error":"#REF!"},{"$error":"#REF!"}]
[null,null,"00:00:00",{"$error":"#REF!"},{"$error":"#REF!"},{"$error":"#REF!"},{"$error":"#REF!"},{"$error":"#REF!"},{"$error":"#REF!"},{"$error":"#REF!"},{"$error":"#REF!"},{"$error":"#REF!"},{"$error":"#REF!"},{"$error":"#REF!"}]
[null,null,"00:00:00",{"$error":"#REF!"},{"$error":"#REF!"},{"$error":"#REF!"},{"$error":"#REF!"},{"$error":"#REF!"},{"$error":"#REF!"},{"$error":"#REF!"},{"$error":"#REF!"},{"$error":"#REF!"},{"$error":"#REF!"},{"$error":"#REF!"}]
[null,null,"00:00:00",{"$error":"#REF!"},{"$error":"#REF!"},{"$error":"#REF!"},{"$error":"#REF!"},{"$error":"#REF!"},{"$error":"#REF!"},{"$error":"#REF!"},{"$error":"#REF!"},{"$error":"#REF!"},{"$error":"#REF!"},{"$error":"#REF!"}]
[null,null,"00:00:00",{"$error":"#REF!"},{"$error":"#REF!"},{"$error":"#REF!"},{"$error":"#REF!"},{"$error":"#REF!"},{"$error":"#REF!"},{"$error":"#REF!"},{"$error":"#REF!"},{"$error":"#REF!"},{"$error":"#REF!"},{"$error":"#REF!"}]
[null,null,"00:00:00",{"$error":"#REF!"},{"$error":"#REF!"},{"$error":"#REF!"},{"$error":"#REF!"},{"$error":"#REF!"},{"$error":"#REF!"},{"$error":"#REF!"},{"$error":"#REF!"},{"$error":"#REF!"},{"$error":"#REF!"},{"$error":"#REF!"}]
[null,null,"00:00:00",{"$error":"#REF!"},{"$error":"#REF!"},{"$error":"#REF!"},{"$error":"#REF!"},{"$error":"#REF!"},{"$error":"#REF!"},{"$error":"#REF!"},{"$error":"#REF!"},{"$error":"#REF!"},{"$error":"#REF!"},{"$error":"#REF!"}]
[null,null,"00:00:00",{"$error":"#REF!"},{"$error":"#REF!"},{"$error":"#REF!"},{"$error":"#REF!"},{"$error":"#REF!"},{"$error":"#REF!"},{"$error":"#REF!"},{"$error":"#REF!"},{"$error":"#REF!"},{"$error":"#REF!"},{"$error":"#REF!"}]
[null,null,"00:00:00",{"$error":"#REF!"},{"$error":"#REF!"},{"$error":"#REF!"},{"$error":"#REF!"},{"$error":"#REF!"},{"$error":"#REF!"},{"$error":"#REF!"},{"$error":"#REF!"},{"$error":"#REF!"},{"$error":"#REF!"},{"$error":"#REF!"}]
[null,null,"00:00:00",{"$error":"#REF!"},{"$error":"#REF!"},{"$error":"#REF!"},{"$error":"#REF!"},{"$error":"#REF!"},{"$error":"#REF!"},{"$error":"#REF!"},{"$error":"#REF!"},{"$error":"#REF!"},{"$error":"#REF!"},{"$error":"#REF!"}]
[null,null,"00:00:00",{"$f":"$G$49","v":{"$error":"#REF!"}},{"$error":"#REF!"},{"$error":"#REF!"},{"$error":"#REF!"},{"$error":"#REF!"},{"$error":"#REF!"},{"$error":"#REF!"},{"$error":"#REF!"},{"$error":"#REF!"},{"$error":"#REF!"},{"$error":"#REF!"}]
[null,null,{"$f":"B930","v":"00:00:00"},{"$error":"#REF!"},{"$error":"#REF!"},{"$f":"+$C$80+$H$80","v":{"$error":"#REF!"}},{"$f":"+$C$78+$H$78","v":{"$error":"#REF!"}},{"$f":"+$C$76+$C$84","v":{"$error":"#REF!"}},{"$f":"D930-E930-F930-G930-H930","v":{"$error":"#REF!"}},{"$error":"#REF!"},{"$error":"#REF!"},{"$error":"#REF!"},{"$error":"#REF!"},{"$f":"M930-K930","v":{"$error":"#REF!"}}]
[null,null,"00:00:00",{"$error":"#REF!"},{"$f":"+$C$82+$H$82","v":{"$error":"#REF!"}},{"$error":"#REF!"},{"$error":"#REF!"},{"$error":"#REF!"},{"$error":"#REF!"},{"$error":"#REF!"},{"$error":"#REF!"},{"$f":"M930+I931","v":{"$error":"#REF!"}},{"$f":"L931*(1+$C$44)","v":{"$error":"#REF!"}},{"$error":"#REF!"}]
[null,null,"00:00:00",{"$error":"#REF!"},{"$error":"#REF!"},{"$error":"#REF!"},{"$error":"#REF!"},{"$error":"#REF!"},{"$error":"#REF!"},{"$f":"+K931+I932","v":{"$error":"#REF!"}},{"$error":"#REF!"},{"$error":"#REF!"},{"$error":"#REF!"},{"$error":"#REF!"}]
[null,null,"00:00:00",{"$error":"#REF!"},{"$error":"#REF!"},{"$error":"#REF!"},{"$error":"#REF!"},{"$error":"#REF!"},{"$error":"#REF!"},{"$error":"#REF!"},{"$f":"+(1+$C$42)*J933","v":{"$error":"#REF!"}},{"$error":"#REF!"},{"$error":"#REF!"},{"$error":"#REF!"}]
[null,null,"00:00:00",{"$error":"#REF!"},{"$error":"#REF!"},{"$error":"#REF!"},{"$error":"#REF!"},{"$error":"#REF!"},{"$error":"#REF!"},{"$error":"#REF!"},{"$error":"#REF!"},{"$error":"#REF!"},{"$error":"#REF!"},{"$error":"#REF!"}]
[null,null,"00:00:00",{"$error":"#REF!"},{"$error":"#REF!"},{"$error":"#REF!"},{"$error":"#REF!"},{"$error":"#REF!"},{"$error":"#REF!"},{"$error":"#REF!"},{"$error":"#REF!"},{"$error":"#REF!"},{"$error":"#REF!"},{"$error":"#REF!"}]
[null,null,"00:00:00",{"$error":"#REF!"},{"$error":"#REF!"},{"$error":"#REF!"},{"$error":"#REF!"},{"$error":"#REF!"},{"$error":"#REF!"},{"$error":"#REF!"},{"$error":"#REF!"},{"$error":"#REF!"},{"$error":"#REF!"},{"$error":"#REF!"}]
[null,null,"00:00:00",{"$error":"#REF!"},{"$error":"#REF!"},{"$error":"#REF!"},{"$error":"#REF!"},{"$error":"#REF!"},{"$error":"#REF!"},{"$error":"#REF!"},{"$error":"#REF!"},{"$error":"#REF!"},{"$error":"#REF!"},{"$error":"#REF!"}]
[null,null,"00:00:00",{"$error":"#REF!"},{"$error":"#REF!"},{"$error":"#REF!"},{"$error":"#REF!"},{"$error":"#REF!"},{"$error":"#REF!"},{"$error":"#REF!"},{"$error":"#REF!"},{"$error":"#REF!"},{"$error":"#REF!"},{"$error":"#REF!"}]
[null,null,"00:00:00",{"$error":"#REF!"},{"$error":"#REF!"},{"$error":"#REF!"},{"$error":"#REF!"},{"$error":"#REF!"},{"$error":"#REF!"},{"$error":"#REF!"},{"$error":"#REF!"},{"$error":"#REF!"},{"$error":"#REF!"},{"$error":"#REF!"}]
[null,null,"00:00:00",{"$error":"#REF!"},{"$error":"#REF!"},{"$error":"#REF!"},{"$error":"#REF!"},{"$error":"#REF!"},{"$error":"#REF!"},{"$error":"#REF!"},{"$error":"#REF!"},{"$error":"#REF!"},{"$error":"#REF!"},{"$error":"#REF!"}]
[null,null,"00:00:00",{"$error":"#REF!"},{"$error":"#REF!"},{"$error":"#REF!"},{"$error":"#REF!"},{"$error":"#REF!"},{"$error":"#REF!"},{"$error":"#REF!"},{"$error":"#REF!"},{"$error":"#REF!"},{"$error":"#REF!"},{"$error":"#REF!"}]
[null,null,"00:00:00",{"$error":"#REF!"},{"$error":"#REF!"},{"$error":"#REF!"},{"$error":"#REF!"},{"$error":"#REF!"},{"$error":"#REF!"},{"$error":"#REF!"},{"$error":"#REF!"},{"$error":"#REF!"},{"$error":"#REF!"},{"$error":"#REF!"}]
[null,null,"00:00:00",{"$error":"#REF!"},{"$error":"#REF!"},{"$error":"#REF!"},{"$error":"#REF!"},{"$error":"#REF!"},{"$error":"#REF!"},{"$error":"#REF!"},{"$error":"#REF!"},{"$error":"#REF!"},{"$error":"#REF!"},{"$error":"#REF!"}]
[null,null,"00:00:00",{"$error":"#REF!"},{"$error":"#REF!"},{"$error":"#REF!"},{"$error":"#REF!"},{"$error":"#REF!"},{"$error":"#REF!"},{"$error":"#REF!"},{"$error":"#REF!"},{"$error":"#REF!"},{"$error":"#REF!"},{"$error":"#REF!"}]
[null,null,"00:00:00",{"$error":"#REF!"},{"$error":"#REF!"},{"$error":"#REF!"},{"$error":"#REF!"},{"$error":"#REF!"},{"$error":"#REF!"},{"$error":"#REF!"},{"$error":"#REF!"},{"$error":"#REF!"},{"$error":"#REF!"},{"$error":"#REF!"}]
[null,null,"00:00:00",{"$error":"#REF!"},{"$error":"#REF!"},{"$error":"#REF!"},{"$error":"#REF!"},{"$error":"#REF!"},{"$error":"#REF!"},{"$error":"#REF!"},{"$error":"#REF!"},{"$error":"#REF!"},{"$error":"#REF!"},{"$error":"#REF!"}]
[null,null,"00:00:00",{"$error":"#REF!"},{"$error":"#REF!"},{"$error":"#REF!"},{"$error":"#REF!"},{"$error":"#REF!"},{"$error":"#REF!"},{"$error":"#REF!"},{"$error":"#REF!"},{"$error":"#REF!"},{"$error":"#REF!"},{"$error":"#REF!"}]
[null,null,"00:00:00",{"$error":"#REF!"},{"$error":"#REF!"},{"$error":"#REF!"},{"$error":"#REF!"},{"$error":"#REF!"},{"$error":"#REF!"},{"$error":"#REF!"},{"$error":"#REF!"},{"$error":"#REF!"},{"$error":"#REF!"},{"$error":"#REF!"}]
[null,null,"00:00:00",{"$error":"#REF!"},{"$error":"#REF!"},{"$error":"#REF!"},{"$error":"#REF!"},{"$error":"#REF!"},{"$error":"#REF!"},{"$error":"#REF!"},{"$error":"#REF!"},{"$error":"#REF!"},{"$error":"#REF!"},{"$error":"#REF!"}]
[null,null,"00:00:00",{"$error":"#REF!"},{"$error":"#REF!"},{"$error":"#REF!"},{"$error":"#REF!"},{"$error":"#REF!"},{"$error":"#REF!"},{"$error":"#REF!"},{"$error":"#REF!"},{"$error":"#REF!"},{"$error":"#REF!"},{"$error":"#REF!"}]
[null,null,"00:00:00",{"$error":"#REF!"},{"$error":"#REF!"},{"$error":"#REF!"},{"$error":"#REF!"},{"$error":"#REF!"},{"$error":"#REF!"},{"$error":"#REF!"},{"$error":"#REF!"},{"$error":"#REF!"},{"$error":"#REF!"},{"$error":"#REF!"}]
[null,null,"00:00:00",{"$error":"#REF!"},{"$error":"#REF!"},{"$error":"#REF!"},{"$error":"#REF!"},{"$error":"#REF!"},{"$error":"#REF!"},{"$error":"#REF!"},{"$error":"#REF!"},{"$error":"#REF!"},{"$error":"#REF!"},{"$error":"#REF!"}]
[null,null,"00:00:00",{"$error":"#REF!"},{"$error":"#REF!"},{"$error":"#REF!"},{"$error":"#REF!"},{"$error":"#REF!"},{"$error":"#REF!"},{"$error":"#REF!"},{"$error":"#REF!"},{"$error":"#REF!"},{"$error":"#REF!"},{"$error":"#REF!"}]
[null,null,"00:00:00",{"$error":"#REF!"},{"$error":"#REF!"},{"$error":"#REF!"},{"$error":"#REF!"},{"$error":"#REF!"},{"$error":"#REF!"},{"$error":"#REF!"},{"$error":"#REF!"},{"$error":"#REF!"},{"$error":"#REF!"},{"$error":"#REF!"}]
[null,null,"00:00:00",{"$error":"#REF!"},{"$error":"#REF!"},{"$error":"#REF!"},{"$error":"#REF!"},{"$error":"#REF!"},{"$error":"#REF!"},{"$error":"#REF!"},{"$error":"#REF!"},{"$error":"#REF!"},{"$error":"#REF!"},{"$error":"#REF!"}]
[null,null,"00:00:00",{"$error":"#REF!"},{"$error":"#REF!"},{"$error":"#REF!"},{"$error":"#REF!"},{"$error":"#REF!"},{"$error":"#REF!"},{"$error":"#REF!"},{"$error":"#REF!"},{"$error":"#REF!"},{"$error":"#REF!"},{"$error":"#REF!"}]
[null,null,"00:00:00",{"$error":"#REF!"},{"$error":"#REF!"},{"$error":"#REF!"},{"$error":"#REF!"},{"$error":"#REF!"},{"$error":"#REF!"},{"$error":"#REF!"},{"$error":"#REF!"},{"$error":"#REF!"},{"$error":"#REF!"},{"$error":"#REF!"}]
[null,null,"00:00:00",{"$error":"#REF!"},{"$error":"#REF!"},{"$error":"#REF!"},{"$error":"#REF!"},{"$error":"#REF!"},{"$error":"#REF!"},{"$error":"#REF!"},{"$error":"#REF!"},{"$error":"#REF!"},{"$error":"#REF!"},{"$error":"#REF!"}]
[null,null,"00:00:00",{"$error":"#REF!"},{"$error":"#REF!"},{"$error":"#REF!"},{"$error":"#REF!"},{"$error":"#REF!"},{"$error":"#REF!"},{"$error":"#REF!"},{"$error":"#REF!"},{"$error":"#REF!"},{"$error":"#REF!"},{"$error":"#REF!"}]
[null,null,"00:00:00",{"$error":"#REF!"},{"$error":"#REF!"},{"$error":"#REF!"},{"$error":"#REF!"},{"$error":"#REF!"},{"$error":"#REF!"},{"$error":"#REF!"},{"$error":"#REF!"},{"$error":"#REF!"},{"$error":"#REF!"},{"$error":"#REF!"}]
[null,null,"00:00:00",{"$error":"#REF!"},{"$error":"#REF!"},{"$error":"#REF!"},{"$error":"#REF!"},{"$error":"#REF!"},{"$error":"#REF!"},{"$error":"#REF!"},{"$error":"#REF!"},{"$error":"#REF!"},{"$error":"#REF!"},{"$error":"#REF!"}]
[null,null,"00:00:00",{"$error":"#REF!"},{"$error":"#REF!"},{"$error":"#REF!"},{"$error":"#REF!"},{"$error":"#REF!"},{"$error":"#REF!"},{"$error":"#REF!"},{"$error":"#REF!"},{"$error":"#REF!"},{"$error":"#REF!"},{"$error":"#REF!"}]
[null,null,"00:00:00",{"$error":"#REF!"},{"$error":"#REF!"},{"$error":"#REF!"},{"$error":"#REF!"},{"$error":"#REF!"},{"$error":"#REF!"},{"$error":"#REF!"},{"$error":"#REF!"},{"$error":"#REF!"},{"$error":"#REF!"},{"$error":"#REF!"}]
[null,null,"00:00:00",{"$error":"#REF!"},{"$error":"#REF!"},{"$error":"#REF!"},{"$error":"#REF!"},{"$error":"#REF!"},{"$error":"#REF!"},{"$error":"#REF!"},{"$error":"#REF!"},{"$error":"#REF!"},{"$error":"#REF!"},{"$error":"#REF!"}]
[null,null,"00:00:00",{"$error":"#REF!"},{"$error":"#REF!"},{"$error":"#REF!"},{"$error":"#REF!"},{"$error":"#REF!"},{"$error":"#REF!"},{"$error":"#REF!"},{"$error":"#REF!"},{"$error":"#REF!"},{"$error":"#REF!"},{"$error":"#REF!"}]
[null,null,"00:00:00",{"$error":"#REF!"},{"$error":"#REF!"},{"$error":"#REF!"},{"$error":"#REF!"},{"$error":"#REF!"},{"$error":"#REF!"},{"$error":"#REF!"},{"$error":"#REF!"},{"$error":"#REF!"},{"$error":"#REF!"},{"$error":"#REF!"}]
[null,null,"00:00:00",{"$error":"#REF!"},{"$error":"#REF!"},{"$error":"#REF!"},{"$error":"#REF!"},{"$error":"#REF!"},{"$error":"#REF!"},{"$error":"#REF!"},{"$error":"#REF!"},{"$error":"#REF!"},{"$error":"#REF!"},{"$error":"#REF!"}]
[null,null,"00:00:00",{"$error":"#REF!"},{"$error":"#REF!"},{"$error":"#REF!"},{"$error":"#REF!"},{"$error":"#REF!"},{"$error":"#REF!"},{"$error":"#REF!"},{"$error":"#REF!"},{"$error":"#REF!"},{"$error":"#REF!"},{"$error":"#REF!"}]
[null,null,"00:00:00",{"$error":"#REF!"},{"$error":"#REF!"},{"$error":"#REF!"},{"$error":"#REF!"},{"$error":"#REF!"},{"$error":"#REF!"},{"$error":"#REF!"},{"$error":"#REF!"},{"$error":"#REF!"},{"$error":"#REF!"},{"$error":"#REF!"}]
[null,null,"00:00:00",{"$error":"#REF!"},{"$error":"#REF!"},{"$error":"#REF!"},{"$error":"#REF!"},{"$error":"#REF!"},{"$error":"#REF!"},{"$error":"#REF!"},{"$error":"#REF!"},{"$error":"#REF!"},{"$error":"#REF!"},{"$error":"#REF!"}]
[null,null,"00:00:00",{"$error":"#REF!"},{"$error":"#REF!"},{"$error":"#REF!"},{"$error":"#REF!"},{"$error":"#REF!"},{"$error":"#REF!"},{"$error":"#REF!"},{"$error":"#REF!"},{"$error":"#REF!"},{"$error":"#REF!"},{"$error":"#REF!"}]
[null,null,"00:00:00",{"$error":"#REF!"},{"$error":"#REF!"},{"$error":"#REF!"},{"$error":"#REF!"},{"$error":"#REF!"},{"$error":"#REF!"},{"$error":"#REF!"},{"$error":"#REF!"},{"$error":"#REF!"},{"$error":"#REF!"},{"$error":"#REF!"}]
[null,null,"00:00:00",{"$error":"#REF!"},{"$error":"#REF!"},{"$error":"#REF!"},{"$error":"#REF!"},{"$error":"#REF!"},{"$error":"#REF!"},{"$error":"#REF!"},{"$error":"#REF!"},{"$error":"#REF!"},{"$error":"#REF!"},{"$error":"#REF!"}]
[null,null,"00:00:00",{"$error":"#REF!"},{"$error":"#REF!"},{"$error":"#REF!"},{"$error":"#REF!"},{"$error":"#REF!"},{"$error":"#REF!"},{"$error":"#REF!"},{"$error":"#REF!"},{"$error":"#REF!"},{"$error":"#REF!"},{"$error":"#REF!"}]
[null,null,"00:00:00",{"$error":"#REF!"},{"$error":"#REF!"},{"$error":"#REF!"},{"$error":"#REF!"},{"$error":"#REF!"},{"$error":"#REF!"},{"$error":"#REF!"},{"$error":"#REF!"},{"$error":"#REF!"},{"$error":"#REF!"},{"$error":"#REF!"}]
[null,null,"00:00:00",{"$error":"#REF!"},{"$error":"#REF!"},{"$error":"#REF!"},{"$error":"#REF!"},{"$error":"#REF!"},{"$error":"#REF!"},{"$error":"#REF!"},{"$error":"#REF!"},{"$error":"#REF!"},{"$error":"#REF!"},{"$error":"#REF!"}]
[null,null,"00:00:00",{"$error":"#REF!"},{"$error":"#REF!"},{"$error":"#REF!"},{"$error":"#REF!"},{"$error":"#REF!"},{"$error":"#REF!"},{"$error":"#REF!"},{"$error":"#REF!"},{"$error":"#REF!"},{"$error":"#REF!"},{"$error":"#REF!"}]
[null,null,"00:00:00",{"$error":"#REF!"},{"$error":"#REF!"},{"$error":"#REF!"},{"$error":"#REF!"},{"$error":"#REF!"},{"$error":"#REF!"},{"$error":"#REF!"},{"$error":"#REF!"},{"$error":"#REF!"},{"$error":"#REF!"},{"$error":"#REF!"}]
[null,null,"00:00:00",{"$error":"#REF!"},{"$error":"#REF!"},{"$error":"#REF!"},{"$error":"#REF!"},{"$error":"#REF!"},{"$error":"#REF!"},{"$error":"#REF!"},{"$error":"#REF!"},{"$error":"#REF!"},{"$error":"#REF!"},{"$error":"#REF!"}]
[null,null,"00:00:00",{"$error":"#REF!"},{"$error":"#REF!"},{"$error":"#REF!"},{"$error":"#REF!"},{"$error":"#REF!"},{"$error":"#REF!"},{"$error":"#REF!"},{"$error":"#REF!"},{"$error":"#REF!"},{"$error":"#REF!"},{"$error":"#REF!"}]
[null,null,"00:00:00",{"$error":"#REF!"},{"$error":"#REF!"},{"$error":"#REF!"},{"$error":"#REF!"},{"$error":"#REF!"},{"$error":"#REF!"},{"$error":"#REF!"},{"$error":"#REF!"},{"$error":"#REF!"},{"$error":"#REF!"},{"$error":"#REF!"}]
[null,null,"00:00:00",{"$error":"#REF!"},{"$error":"#REF!"},{"$error":"#REF!"},{"$error":"#REF!"},{"$error":"#REF!"},{"$error":"#REF!"},{"$error":"#REF!"},{"$error":"#REF!"},{"$error":"#REF!"},{"$error":"#REF!"},{"$error":"#REF!"}]
[null,null,"00:00:00",{"$error":"#REF!"},{"$error":"#REF!"},{"$error":"#REF!"},{"$error":"#REF!"},{"$error":"#REF!"},{"$error":"#REF!"},{"$error":"#REF!"},{"$error":"#REF!"},{"$error":"#REF!"},{"$error":"#REF!"},{"$error":"#REF!"}]
[null,null,"00:00:00",{"$error":"#REF!"},{"$error":"#REF!"},{"$error":"#REF!"},{"$error":"#REF!"},{"$error":"#REF!"},{"$error":"#REF!"},{"$error":"#REF!"},{"$error":"#REF!"},{"$error":"#REF!"},{"$error":"#REF!"},{"$error":"#REF!"}]
[null,null,"00:00:00",{"$error":"#REF!"},{"$error":"#REF!"},{"$error":"#REF!"},{"$error":"#REF!"},{"$error":"#REF!"},{"$error":"#REF!"},{"$error":"#REF!"},{"$error":"#REF!"},{"$error":"#REF!"},{"$error":"#REF!"},{"$error":"#REF!"}]
[null,null,"00:00:00",{"$error":"#REF!"},{"$error":"#REF!"},{"$error":"#REF!"},{"$error":"#REF!"},{"$error":"#REF!"},{"$error":"#REF!"},{"$error":"#REF!"},{"$error":"#REF!"},{"$error":"#REF!"},{"$error":"#REF!"},{"$error":"#REF!"}]
[null,null,"00:00:00",{"$error":"#REF!"},{"$error":"#REF!"},{"$error":"#REF!"},{"$error":"#REF!"},{"$error":"#REF!"},{"$error":"#REF!"},{"$error":"#REF!"},{"$error":"#REF!"},{"$error":"#REF!"},{"$error":"#REF!"},{"$error":"#REF!"}]
[null,null,"00:00:00",{"$error":"#REF!"},{"$error":"#REF!"},{"$error":"#REF!"},{"$error":"#REF!"},{"$error":"#REF!"},{"$error":"#REF!"},{"$error":"#REF!"},{"$error":"#REF!"},{"$error":"#REF!"},{"$error":"#REF!"},{"$error":"#REF!"}]
[null,null,"00:00:00",{"$error":"#REF!"},{"$error":"#REF!"},{"$error":"#REF!"},{"$error":"#REF!"},{"$error":"#REF!"},{"$error":"#REF!"},{"$error":"#REF!"},{"$error":"#REF!"},{"$error":"#REF!"},{"$error":"#REF!"},{"$error":"#REF!"}]
[null,null,"00:00:00",{"$error":"#REF!"},{"$error":"#REF!"},{"$error":"#REF!"},{"$error":"#REF!"},{"$error":"#REF!"},{"$error":"#REF!"},{"$error":"#REF!"},{"$error":"#REF!"},{"$error":"#REF!"},{"$error":"#REF!"},{"$error":"#REF!"}]
[null,null,"00:00:00",{"$error":"#REF!"},{"$error":"#REF!"},{"$error":"#REF!"},{"$error":"#REF!"},{"$error":"#REF!"},{"$error":"#REF!"},{"$error":"#REF!"},{"$error":"#REF!"},{"$error":"#REF!"},{"$error":"#REF!"},{"$error":"#REF!"}]
[null,null,"00:00:00",{"$error":"#REF!"},{"$error":"#REF!"},{"$error":"#REF!"},{"$error":"#REF!"},{"$error":"#REF!"},{"$error":"#REF!"},{"$error":"#REF!"},{"$error":"#REF!"},{"$error":"#REF!"},{"$error":"#REF!"},{"$error":"#REF!"}]
[null,null,"00:00:00",{"$f":"$G$49","v":{"$error":"#REF!"}},{"$error":"#REF!"},{"$error":"#REF!"},{"$error":"#REF!"},{"$error":"#REF!"},{"$error":"#REF!"},{"$error":"#REF!"},{"$error":"#REF!"},{"$error":"#REF!"},{"$error":"#REF!"},{"$error":"#REF!"}]
[null,null,{"$f":"B994","v":"00:00:00"},{"$error":"#REF!"},{"$error":"#REF!"},{"$f":"+$C$80+$H$80","v":{"$error":"#REF!"}},{"$f":"+$C$78+$H$78","v":{"$error":"#REF!"}},{"$f":"+$C$76+$C$84","v":{"$error":"#REF!"}},{"$f":"D994-E994-F994-G994-H994","v":{"$error":"#REF!"}},{"$error":"#REF!"},{"$error":"#REF!"},{"$error":"#REF!"},{"$error":"#REF!"},{"$f":"M994-K994","v":{"$error":"#REF!"}}]
[null,null,"00:00:00",{"$error":"#REF!"},{"$f":"+$C$82+$H$82","v":{"$error":"#REF!"}},{"$error":"#REF!"},{"$error":"#REF!"},{"$error":"#REF!"},{"$error":"#REF!"},{"$error":"#REF!"},{"$error":"#REF!"},{"$f":"M994+I995","v":{"$error":"#REF!"}},{"$f":"L995*(1+$C$44)","v":{"$error":"#REF!"}},{"$error":"#REF!"}]
[null,null,"00:00:00",{"$error":"#REF!"},{"$error":"#REF!"},{"$error":"#REF!"},{"$error":"#REF!"},{"$error":"#REF!"},{"$error":"#REF!"},{"$f":"+K995+I996","v":{"$error":"#REF!"}},{"$error":"#REF!"},{"$error":"#REF!"},{"$error":"#REF!"},{"$error":"#REF!"}]
[null,null,"00:00:00",{"$error":"#REF!"},{"$error":"#REF!"},{"$error":"#REF!"},{"$error":"#REF!"},{"$error":"#REF!"},{"$error":"#REF!"},{"$error":"#REF!"},{"$f":"+(1+$C$42)*J997","v":{"$error":"#REF!"}},{"$error":"#REF!"},{"$error":"#REF!"},{"$error":"#REF!"}]
[null,null,"00:00:00",{"$error":"#REF!"},{"$error":"#REF!"},{"$error":"#REF!"},{"$error":"#REF!"},{"$error":"#REF!"},{"$error":"#REF!"},{"$error":"#REF!"},{"$error":"#REF!"},{"$error":"#REF!"},{"$error":"#REF!"},{"$error":"#REF!"}]
[null,null,"00:00:00",{"$error":"#REF!"},{"$error":"#REF!"},{"$error":"#REF!"},{"$error":"#REF!"},{"$error":"#REF!"},{"$error":"#REF!"},{"$error":"#REF!"},{"$error":"#REF!"},{"$error":"#REF!"},{"$error":"#REF!"},{"$error":"#REF!"}]
[null,null,"00:00:00",{"$error":"#REF!"},{"$error":"#REF!"},{"$error":"#REF!"},{"$error":"#REF!"},{"$error":"#REF!"},{"$error":"#REF!"},{"$error":"#REF!"},{"$error":"#REF!"},{"$error":"#REF!"},{"$error":"#REF!"},{"$error":"#REF!"}]
[null,null,"00:00:00",{"$error":"#REF!"},{"$error":"#REF!"},{"$error":"#REF!"},{"$error":"#REF!"},{"$error":"#REF!"},{"$error":"#REF!"},{"$error":"#REF!"},{"$error":"#REF!"},{"$error":"#REF!"},{"$error":"#REF!"},{"$error":"#REF!"}]
[null,null,"00:00:00",{"$error":"#REF!"},{"$error":"#REF!"},{"$error":"#REF!"},{"$error":"#REF!"},{"$error":"#REF!"},{"$error":"#REF!"},{"$error":"#REF!"},{"$error":"#REF!"},{"$error":"#REF!"},{"$error":"#REF!"},{"$error":"#REF!"}]
[null,null,"00:00:00",{"$error":"#REF!"},{"$error":"#REF!"},{"$error":"#REF!"},{"$error":"#REF!"},{"$error":"#REF!"},{"$error":"#REF!"},{"$error":"#REF!"},{"$error":"#REF!"},{"$error":"#REF!"},{"$error":"#REF!"},{"$error":"#REF!"}]
[null,null,"00:00:00",{"$error":"#REF!"},{"$error":"#REF!"},{"$error":"#REF!"},{"$error":"#REF!"},{"$error":"#REF!"},{"$error":"#REF!"},{"$error":"#REF!"},{"$error":"#REF!"},{"$error":"#REF!"},{"$error":"#REF!"},{"$error":"#REF!"}]
[null,null,"00:00:00",{"$error":"#REF!"},{"$error":"#REF!"},{"$error":"#REF!"},{"$error":"#REF!"},{"$error":"#REF!"},{"$error":"#REF!"},{"$error":"#REF!"},{"$error":"#REF!"},{"$error":"#REF!"},{"$error":"#REF!"},{"$error":"#REF!"}]
[null,null,"00:00:00",{"$error":"#REF!"},{"$error":"#REF!"},{"$error":"#REF!"},{"$error":"#REF!"},{"$error":"#REF!"},{"$error":"#REF!"},{"$error":"#REF!"},{"$error":"#REF!"},{"$error":"#REF!"},{"$error":"#REF!"},{"$error":"#REF!"}]
[null,null,"00:00:00",{"$error":"#REF!"},{"$error":"#REF!"},{"$error":"#REF!"},{"$error":"#REF!"},{"$error":"#REF!"},{"$error":"#REF!"},{"$error":"#REF!"},{"$error":"#REF!"},{"$error":"#REF!"},{"$error":"#REF!"},{"$error":"#REF!"}]
[null,null,"00:00:00",{"$error":"#REF!"},{"$error":"#REF!"},{"$error":"#REF!"},{"$error":"#REF!"},{"$error":"#REF!"},{"$error":"#REF!"},{"$error":"#REF!"},{"$error":"#REF!"},{"$error":"#REF!"},{"$error":"#REF!"},{"$error":"#REF!"}]
[null,null,"00:00:00",{"$error":"#REF!"},{"$error":"#REF!"},{"$error":"#REF!"},{"$error":"#REF!"},{"$error":"#REF!"},{"$error":"#REF!"},{"$error":"#REF!"},{"$error":"#REF!"},{"$error":"#REF!"},{"$error":"#REF!"},{"$error":"#REF!"}]
[null,null,"00:00:00",{"$error":"#REF!"},{"$error":"#REF!"},{"$error":"#REF!"},{"$error":"#REF!"},{"$error":"#REF!"},{"$error":"#REF!"},{"$error":"#REF!"},{"$error":"#REF!"},{"$error":"#REF!"},{"$error":"#REF!"},{"$error":"#REF!"}]
[null,null,"00:00:00",{"$error":"#REF!"},{"$error":"#REF!"},{"$error":"#REF!"},{"$error":"#REF!"},{"$error":"#REF!"},{"$error":"#REF!"},{"$error":"#REF!"},{"$error":"#REF!"},{"$error":"#REF!"},{"$error":"#REF!"},{"$error":"#REF!"}]
[null,null,"00:00:00",{"$error":"#REF!"},{"$error":"#REF!"},{"$error":"#REF!"},{"$error":"#REF!"},{"$error":"#REF!"},{"$error":"#REF!"},{"$error":"#REF!"},{"$error":"#REF!"},{"$error":"#REF!"},{"$error":"#REF!"},{"$error":"#REF!"}]
[null,null,"00:00:00",{"$error":"#REF!"},{"$error":"#REF!"},{"$error":"#REF!"},{"$error":"#REF!"},{"$error":"#REF!"},{"$error":"#REF!"},{"$error":"#REF!"},{"$error":"#REF!"},{"$error":"#REF!"},{"$error":"#REF!"},{"$error":"#REF!"}]
[null,null,"00:00:00",{"$error":"#REF!"},{"$error":"#REF!"},{"$error":"#REF!"},{"$error":"#REF!"},{"$error":"#REF!"},{"$error":"#REF!"},{"$error":"#REF!"},{"$error":"#REF!"},{"$error":"#REF!"},{"$error":"#REF!"},{"$error":"#REF!"}]
[null,null,"00:00:00",{"$error":"#REF!"},{"$error":"#REF!"},{"$error":"#REF!"},{"$error":"#REF!"},{"$error":"#REF!"},{"$error":"#REF!"},{"$error":"#REF!"},{"$error":"#REF!"},{"$error":"#REF!"},{"$error":"#REF!"},{"$error":"#REF!"}]
[null,null,"00:00:00",{"$error":"#REF!"},{"$error":"#REF!"},{"$error":"#REF!"},{"$error":"#REF!"},{"$error":"#REF!"},{"$error":"#REF!"},{"$error":"#REF!"},{"$error":"#REF!"},{"$error":"#REF!"},{"$error":"#REF!"},{"$error":"#REF!"}]
[null,null,"00:00:00",{"$error":"#REF!"},{"$error":"#REF!"},{"$error":"#REF!"},{"$error":"#REF!"},{"$error":"#REF!"},{"$error":"#REF!"},{"$error":"#REF!"},{"$error":"#REF!"},{"$error":"#REF!"},{"$error":"#REF!"},{"$error":"#REF!"}]
[null,null,"00:00:00",{"$error":"#REF!"},{"$error":"#REF!"},{"$error":"#REF!"},{"$error":"#REF!"},{"$error":"#REF!"},{"$error":"#REF!"},{"$error":"#REF!"},{"$error":"#REF!"},{"$error":"#REF!"},{"$error":"#REF!"},{"$error":"#REF!"}]
[null,null,"00:00:00",{"$error":"#REF!"},{"$error":"#REF!"},{"$error":"#REF!"},{"$error":"#REF!"},{"$error":"#REF!"},{"$error":"#REF!"},{"$error":"#REF!"},{"$error":"#REF!"},{"$error":"#REF!"},{"$error":"#REF!"},{"$error":"#REF!"}]
[null,null,"00:00:00",{"$error":"#REF!"},{"$error":"#REF!"},{"$error":"#REF!"},{"$error":"#REF!"},{"$error":"#REF!"},{"$error":"#REF!"},{"$error":"#REF!"},{"$error":"#REF!"},{"$error":"#REF!"},{"$error":"#REF!"},{"$error":"#REF!"}]
[null,null,"00:00:00",{"$error":"#REF!"},{"$error":"#REF!"},{"$error":"#REF!"},{"$error":"#REF!"},{"$error":"#REF!"},{"$error":"#REF!"},{"$error":"#REF!"},{"$error":"#REF!"},{"$error":"#REF!"},{"$error":"#REF!"},{"$error":"#REF!"}]
[null,null,"00:00:00",{"$error":"#REF!"},{"$error":"#REF!"},{"$error":"#REF!"},{"$error":"#REF!"},{"$error":"#REF!"},{"$error":"#REF!"},{"$error":"#REF!"},{"$error":"#REF!"},{"$error":"#REF!"},{"$error":"#REF!"},{"$error":"#REF!"}]
[null,null,"00:00:00",{"$error":"#REF!"},{"$error":"#REF!"},{"$error":"#REF!"},{"$error":"#REF!"},{"$error":"#REF!"},{"$error":"#REF!"},{"$error":"#REF!"},{"$error":"#REF!"},{"$error":"#REF!"},{"$error":"#REF!"},{"$error":"#REF!"}]
[null,null,"00:00:00",{"$error":"#REF!"},{"$error":"#REF!"},{"$error":"#REF!"},{"$error":"#REF!"},{"$error":"#REF!"},{"$error":"#REF!"},{"$error":"#REF!"},{"$error":"#REF!"},{"$error":"#REF!"},{"$error":"#REF!"},{"$error":"#REF!"}]
[null,null,"00:00:00",{"$error":"#REF!"},{"$error":"#REF!"},{"$error":"#REF!"},{"$error":"#REF!"},{"$error":"#REF!"},{"$error":"#REF!"},{"$error":"#REF!"},{"$error":"#REF!"},{"$error":"#REF!"},{"$error":"#REF!"},{"$error":"#REF!"}]
[null,null,"00:00:00",{"$error":"#REF!"},{"$error":"#REF!"},{"$error":"#REF!"},{"$error":"#REF!"},{"$error":"#REF!"},{"$error":"#REF!"},{"$error":"#REF!"},{"$error":"#REF!"},{"$error":"#REF!"},{"$error":"#REF!"},{"$error":"#REF!"}]
[null,null,"00:00:00",{"$error":"#REF!"},{"$error":"#REF!"},{"$error":"#REF!"},{"$error":"#REF!"},{"$error":"#REF!"},{"$error":"#REF!"},{"$error":"#REF!"},{"$error":"#REF!"},{"$error":"#REF!"},{"$error":"#REF!"},{"$error":"#REF!"}]
[null,null,"00:00:00",{"$error":"#REF!"},{"$error":"#REF!"},{"$error":"#REF!"},{"$error":"#REF!"},{"$error":"#REF!"},{"$error":"#REF!"},{"$error":"#REF!"},{"$error":"#REF!"},{"$error":"#REF!"},{"$error":"#REF!"},{"$error":"#REF!"}]
[null,null,"00:00:00",{"$error":"#REF!"},{"$error":"#REF!"},{"$error":"#REF!"},{"$error":"#REF!"},{"$error":"#REF!"},{"$error":"#REF!"},{"$error":"#REF!"},{"$error":"#REF!"},{"$error":"#REF!"},{"$error":"#REF!"},{"$error":"#REF!"}]
[null,null,"00:00:00",{"$error":"#REF!"},{"$error":"#REF!"},{"$error":"#REF!"},{"$error":"#REF!"},{"$error":"#REF!"},{"$error":"#REF!"},{"$error":"#REF!"},{"$error":"#REF!"},{"$error":"#REF!"},{"$error":"#REF!"},{"$error":"#REF!"}]
[null,null,"00:00:00",{"$error":"#REF!"},{"$error":"#REF!"},{"$error":"#REF!"},{"$error":"#REF!"},{"$error":"#REF!"},{"$error":"#REF!"},{"$error":"#REF!"},{"$error":"#REF!"},{"$error":"#REF!"},{"$error":"#REF!"},{"$error":"#REF!"}]
[null,null,"00:00:00",{"$error":"#REF!"},{"$error":"#REF!"},{"$error":"#REF!"},{"$error":"#REF!"},{"$error":"#REF!"},{"$error":"#REF!"},{"$error":"#REF!"},{"$error":"#REF!"},{"$error":"#REF!"},{"$error":"#REF!"},{"$error":"#REF!"}]
[null,null,"00:00:00",{"$error":"#REF!"},{"$error":"#REF!"},{"$error":"#REF!"},{"$error":"#REF!"},{"$error":"#REF!"},{"$error":"#REF!"},{"$error":"#REF!"},{"$error":"#REF!"},{"$error":"#REF!"},{"$error":"#REF!"},{"$error":"#REF!"}]
[null,null,"00:00:00",{"$error":"#REF!"},{"$error":"#REF!"},{"$error":"#REF!"},{"$error":"#REF!"},{"$error":"#REF!"},{"$error":"#REF!"},{"$error":"#REF!"},{"$error":"#REF!"},{"$error":"#REF!"},{"$error":"#REF!"},{"$error":"#REF!"}]
[null,null,"00:00:00",{"$error":"#REF!"},{"$error":"#REF!"},{"$error":"#REF!"},{"$error":"#REF!"},{"$error":"#REF!"},{"$error":"#REF!"},{"$error":"#REF!"},{"$error":"#REF!"},{"$error":"#REF!"},{"$error":"#REF!"},{"$error":"#REF!"}]
[null,null,"00:00:00",{"$error":"#REF!"},{"$error":"#REF!"},{"$error":"#REF!"},{"$error":"#REF!"},{"$error":"#REF!"},{"$error":"#REF!"},{"$error":"#REF!"},{"$error":"#REF!"},{"$error":"#REF!"},{"$error":"#REF!"},{"$error":"#REF!"}]
[null,null,"00:00:00",{"$error":"#REF!"},{"$error":"#REF!"},{"$error":"#REF!"},{"$error":"#REF!"},{"$error":"#REF!"},{"$error":"#REF!"},{"$error":"#REF!"},{"$error":"#REF!"},{"$error":"#REF!"},{"$error":"#REF!"},{"$error":"#REF!"}]
[null,null,"00:00:00",{"$error":"#REF!"},{"$error":"#REF!"},{"$error":"#REF!"},{"$error":"#REF!"},{"$error":"#REF!"},{"$error":"#REF!"},{"$error":"#REF!"},{"$error":"#REF!"},{"$error":"#REF!"},{"$error":"#REF!"},{"$error":"#REF!"}]
[null,null,"00:00:00",{"$error":"#REF!"},{"$error":"#REF!"},{"$error":"#REF!"},{"$error":"#REF!"},{"$error":"#REF!"},{"$error":"#REF!"},{"$error":"#REF!"},{"$error":"#REF!"},{"$error":"#REF!"},{"$error":"#REF!"},{"$error":"#REF!"}]
[null,null,"00:00:00",{"$error":"#REF!"},{"$error":"#REF!"},{"$error":"#REF!"},{"$error":"#REF!"},{"$error":"#REF!"},{"$error":"#REF!"},{"$error":"#REF!"},{"$error":"#REF!"},{"$error":"#REF!"},{"$error":"#REF!"},{"$error":"#REF!"}]
[null,null,"00:00:00",{"$error":"#REF!"},{"$error":"#REF!"},{"$error":"#REF!"},{"$error":"#REF!"},{"$error":"#REF!"},{"$error":"#REF!"},{"$error":"#REF!"},{"$error":"#REF!"},{"$error":"#REF!"},{"$error":"#REF!"},{"$error":"#REF!"}]
[null,null,"00:00:00",{"$error":"#REF!"},{"$error":"#REF!"},{"$error":"#REF!"},{"$error":"#REF!"},{"$error":"#REF!"},{"$error":"#REF!"},{"$error":"#REF!"},{"$error":"#REF!"},{"$error":"#REF!"},{"$error":"#REF!"},{"$error":"#REF!"}]
[null,null,"00:00:00",{"$error":"#REF!"},{"$error":"#REF!"},{"$error":"#REF!"},{"$error":"#REF!"},{"$error":"#REF!"},{"$error":"#REF!"},{"$error":"#REF!"},{"$error":"#REF!"},{"$error":"#REF!"},{"$error":"#REF!"},{"$error":"#REF!"}]
[null,null,"00:00:00",{"$error":"#REF!"},{"$error":"#REF!"},{"$error":"#REF!"},{"$error":"#REF!"},{"$error":"#REF!"},{"$error":"#REF!"},{"$error":"#REF!"},{"$error":"#REF!"},{"$error":"#REF!"},{"$error":"#REF!"},{"$error":"#REF!"}]
[null,null,"00:00:00",{"$error":"#REF!"},{"$error":"#REF!"},{"$error":"#REF!"},{"$error":"#REF!"},{"$error":"#REF!"},{"$error":"#REF!"},{"$error":"#REF!"},{"$error":"#REF!"},{"$error":"#REF!"},{"$error":"#REF!"},{"$error":"#REF!"}]
[null,null,"00:00:00",{"$error":"#REF!"},{"$error":"#REF!"},{"$error":"#REF!"},{"$error":"#REF!"},{"$error":"#REF!"},{"$error":"#REF!"},{"$error":"#REF!"},{"$error":"#REF!"},{"$error":"#REF!"},{"$error":"#REF!"},{"$error":"#REF!"}]
[null,null,"00:00:00",{"$error":"#REF!"},{"$error":"#REF!"},{"$error":"#REF!"},{"$error":"#REF!"},{"$error":"#REF!"},{"$error":"#REF!"},{"$error":"#REF!"},{"$error":"#REF!"},{"$error":"#REF!"},{"$error":"#REF!"},{"$error":"#REF!"}]
[null,null,"00:00:00",{"$error":"#REF!"},{"$error":"#REF!"},{"$error":"#REF!"},{"$error":"#REF!"},{"$error":"#REF!"},{"$error":"#REF!"},{"$error":"#REF!"},{"$error":"#REF!"},{"$error":"#REF!"},{"$error":"#REF!"},{"$error":"#REF!"}]
[null,null,"00:00:00",{"$error":"#REF!"},{"$error":"#REF!"},{"$error":"#REF!"},{"$error":"#REF!"},{"$error":"#REF!"},{"$error":"#REF!"},{"$error":"#REF!"},{"$error":"#REF!"},{"$error":"#REF!"},{"$error":"#REF!"},{"$error":"#REF!"}]
[null,null,"00:00:00",{"$error":"#REF!"},{"$error":"#REF!"},{"$error":"#REF!"},{"$error":"#REF!"},{"$error":"#REF!"},{"$error":"#REF!"},{"$error":"#REF!"},{"$error":"#REF!"},{"$error":"#REF!"},{"$error":"#REF!"},{"$error":"#REF!"}]
[null,null,"00:00:00",{"$error":"#REF!"},{"$error":"#REF!"},{"$error":"#REF!"},{"$error":"#REF!"},{"$error":"#REF!"},{"$error":"#REF!"},{"$error":"#REF!"},{"$error":"#REF!"},{"$error":"#REF!"},{"$error":"#REF!"},{"$error":"#REF!"}]
[null,null,"00:00:00",{"$error":"#REF!"},{"$error":"#REF!"},{"$error":"#REF!"},{"$error":"#REF!"},{"$error":"#REF!"},{"$error":"#REF!"},{"$error":"#REF!"},{"$error":"#REF!"},{"$error":"#REF!"},{"$error":"#REF!"},{"$error":"#REF!"}]
[null,null,"00:00:00",{"$error":"#REF!"},{"$error":"#REF!"},{"$error":"#REF!"},{"$error":"#REF!"},{"$error":"#REF!"},{"$error":"#REF!"},{"$error":"#REF!"},{"$error":"#REF!"},{"$error":"#REF!"},{"$error":"#REF!"},{"$error":"#REF!"}]
[null,null,"00:00:00",{"$error":"#REF!"},{"$error":"#REF!"},{"$error":"#REF!"},{"$error":"#REF!"},{"$error":"#REF!"},{"$error":"#REF!"},{"$error":"#REF!"},{"$error":"#REF!"},{"$error":"#REF!"},{"$error":"#REF!"},{"$error":"#REF!"}]
[null,null,"00:00:00",{"$error":"#REF!"},{"$error":"#REF!"},{"$error":"#REF!"},{"$error":"#REF!"},{"$error":"#REF!"},{"$error":"#REF!"},{"$error":"#REF!"},{"$error":"#REF!"},{"$error":"#REF!"},{"$error":"#REF!"},{"$error":"#REF!"}]
[null,null,"00:00:00",{"$error":"#REF!"},{"$error":"#REF!"},{"$error":"#REF!"},{"$error":"#REF!"},{"$error":"#REF!"},{"$error":"#REF!"},{"$error":"#REF!"},{"$error":"#REF!"},{"$error":"#REF!"},{"$error":"#REF!"},{"$error":"#REF!"}]
[null,null,"00:00:00",{"$f":"$G$49","v":{"$error":"#REF!"}},{"$error":"#REF!"},{"$error":"#REF!"},{"$error":"#REF!"},{"$error":"#REF!"},{"$error":"#REF!"},{"$error":"#REF!"},{"$error":"#REF!"},{"$error":"#REF!"},{"$error":"#REF!"},{"$error":"#REF!"}]
[null,null,{"$f":"B1058","v":"00:00:00"},{"$error":"#REF!"},{"$error":"#REF!"},{"$f":"+$C$80+$H$80","v":{"$error":"#REF!"}},{"$f":"+$C$78+$H$78","v":{"$error":"#REF!"}},{"$f":"+$C$76+$C$84","v":{"$error":"#REF!"}},{"$f":"D1058-E1058-F1058-G1058-H1058","v":{"$error":"#REF!"}},{"$error":"#REF!"},{"$error":"#REF!"},{"$error":"#REF!"},{"$error":"#REF!"},{"$f":"M1058-K1058","v":{"$error":"#REF!"}}]
[null,null,"00:00:00",{"$error":"#REF!"},{"$f":"+$C$82+$H$82","v":{"$error":"#REF!"}},{"$error":"#REF!"},{"$error":"#REF!"},{"$error":"#REF!"},{"$error":"#REF!"},{"$error":"#REF!"},{"$error":"#REF!"},{"$f":"M1058+I1059","v":{"$error":"#REF!"}},{"$f":"L1059*(1+$C$44)","v":{"$error":"#REF!"}},{"$error":"#REF!"}]
[null,null,"00:00:00",{"$error":"#REF!"},{"$error":"#REF!"},{"$error":"#REF!"},{"$error":"#REF!"},{"$error":"#REF!"},{"$error":"#REF!"},{"$f":"+K1059+I1060","v":{"$error":"#REF!"}},{"$error":"#REF!"},{"$error":"#REF!"},{"$error":"#REF!"},{"$error":"#REF!"}]
[null,null,"00:00:00",{"$error":"#REF!"},{"$error":"#REF!"},{"$error":"#REF!"},{"$error":"#REF!"},{"$error":"#REF!"},{"$error":"#REF!"},{"$error":"#REF!"},{"$f":"+(1+$C$42)*J1061","v":{"$error":"#REF!"}},{"$error":"#REF!"},{"$error":"#REF!"},{"$error":"#REF!"}]
[null,null,"00:00:00",{"$error":"#REF!"},{"$error":"#REF!"},{"$error":"#REF!"},{"$error":"#REF!"},{"$error":"#REF!"},{"$error":"#REF!"},{"$error":"#REF!"},{"$error":"#REF!"},{"$error":"#REF!"},{"$error":"#REF!"},{"$error":"#REF!"}]
[null,null,"00:00:00",{"$error":"#REF!"},{"$error":"#REF!"},{"$error":"#REF!"},{"$error":"#REF!"},{"$error":"#REF!"},{"$error":"#REF!"},{"$error":"#REF!"},{"$error":"#REF!"},{"$error":"#REF!"},{"$error":"#REF!"},{"$error":"#REF!"}]
[null,null,"00:00:00",{"$error":"#REF!"},{"$error":"#REF!"},{"$error":"#REF!"},{"$error":"#REF!"},{"$error":"#REF!"},{"$error":"#REF!"},{"$error":"#REF!"},{"$error":"#REF!"},{"$error":"#REF!"},{"$error":"#REF!"},{"$error":"#REF!"}]
[null,null,"00:00:00",{"$error":"#REF!"},{"$error":"#REF!"},{"$error":"#REF!"},{"$error":"#REF!"},{"$error":"#REF!"},{"$error":"#REF!"},{"$error":"#REF!"},{"$error":"#REF!"},{"$error":"#REF!"},{"$error":"#REF!"},{"$error":"#REF!"}]
[null,null,"00:00:00",{"$error":"#REF!"},{"$error":"#REF!"},{"$error":"#REF!"},{"$error":"#REF!"},{"$error":"#REF!"},{"$error":"#REF!"},{"$error":"#REF!"},{"$error":"#REF!"},{"$error":"#REF!"},{"$error":"#REF!"},{"$error":"#REF!"}]
[null,null,"00:00:00",{"$error":"#REF!"},{"$error":"#REF!"},{"$error":"#REF!"},{"$error":"#REF!"},{"$error":"#REF!"},{"$error":"#REF!"},{"$error":"#REF!"},{"$error":"#REF!"},{"$error":"#REF!"},{"$error":"#REF!"},{"$error":"#REF!"}]
[null,null,"00:00:00",{"$error":"#REF!"},{"$error":"#REF!"},{"$error":"#REF!"},{"$error":"#REF!"},{"$error":"#REF!"},{"$error":"#REF!"},{"$error":"#REF!"},{"$error":"#REF!"},{"$error":"#REF!"},{"$error":"#REF!"},{"$error":"#REF!"}]
[null,null,"00:00:00",{"$error":"#REF!"},{"$error":"#REF!"},{"$error":"#REF!"},{"$error":"#REF!"},{"$error":"#REF!"},{"$error":"#REF!"},{"$error":"#REF!"},{"$error":"#REF!"},{"$error":"#REF!"},{"$error":"#REF!"},{"$error":"#REF!"}]
[null,null,"00:00:00",{"$error":"#REF!"},{"$error":"#REF!"},{"$error":"#REF!"},{"$error":"#REF!"},{"$error":"#REF!"},{"$error":"#REF!"},{"$error":"#REF!"},{"$error":"#REF!"},{"$error":"#REF!"},{"$error":"#REF!"},{"$error":"#REF!"}]
[null,null,"00:00:00",{"$error":"#REF!"},{"$error":"#REF!"},{"$error":"#REF!"},{"$error":"#REF!"},{"$error":"#REF!"},{"$error":"#REF!"},{"$error":"#REF!"},{"$error":"#REF!"},{"$error":"#REF!"},{"$error":"#REF!"},{"$error":"#REF!"}]
[null,null,"00:00:00",{"$error":"#REF!"},{"$error":"#REF!"},{"$error":"#REF!"},{"$error":"#REF!"},{"$error":"#REF!"},{"$error":"#REF!"},{"$error":"#REF!"},{"$error":"#REF!"},{"$error":"#REF!"},{"$error":"#REF!"},{"$error":"#REF!"}]
[null,null,"00:00:00",{"$error":"#REF!"},{"$error":"#REF!"},{"$error":"#REF!"},{"$error":"#REF!"},{"$error":"#REF!"},{"$error":"#REF!"},{"$error":"#REF!"},{"$error":"#REF!"},{"$error":"#REF!"},{"$error":"#REF!"},{"$error":"#REF!"}]
[null,null,"00:00:00",{"$error":"#REF!"},{"$error":"#REF!"},{"$error":"#REF!"},{"$error":"#REF!"},{"$error":"#REF!"},{"$error":"#REF!"},{"$error":"#REF!"},{"$error":"#REF!"},{"$error":"#REF!"},{"$error":"#REF!"},{"$error":"#REF!"}]
[null,null,"00:00:00",{"$error":"#REF!"},{"$error":"#REF!"},{"$error":"#REF!"},{"$error":"#REF!"},{"$error":"#REF!"},{"$error":"#REF!"},{"$error":"#REF!"},{"$error":"#REF!"},{"$error":"#REF!"},{"$error":"#REF!"},{"$error":"#REF!"}]
[null,null,"00:00:00",{"$error":"#REF!"},{"$error":"#REF!"},{"$error":"#REF!"},{"$error":"#REF!"},{"$error":"#REF!"},{"$error":"#REF!"},{"$error":"#REF!"},{"$error":"#REF!"},{"$error":"#REF!"},{"$error":"#REF!"},{"$error":"#REF!"}]
[null,null,"00:00:00",{"$error":"#REF!"},{"$error":"#REF!"},{"$error":"#REF!"},{"$error":"#REF!"},{"$error":"#REF!"},{"$error":"#REF!"},{"$error":"#REF!"},{"$error":"#REF!"},{"$error":"#REF!"},{"$error":"#REF!"},{"$error":"#REF!"}]
[null,null,"00:00:00",{"$error":"#REF!"},{"$error":"#REF!"},{"$error":"#REF!"},{"$error":"#REF!"},{"$error":"#REF!"},{"$error":"#REF!"},{"$error":"#REF!"},{"$error":"#REF!"},{"$error":"#REF!"},{"$error":"#REF!"},{"$error":"#REF!"}]
[null,null,"00:00:00",{"$error":"#REF!"},{"$error":"#REF!"},{"$error":"#REF!"},{"$error":"#REF!"},{"$error":"#REF!"},{"$error":"#REF!"},{"$error":"#REF!"},{"$error":"#REF!"},{"$error":"#REF!"},{"$error":"#REF!"},{"$error":"#REF!"}]
[null,null,"00:00:00",{"$error":"#REF!"},{"$error":"#REF!"},{"$error":"#REF!"},{"$error":"#REF!"},{"$error":"#REF!"},{"$error":"#REF!"},{"$error":"#REF!"},{"$error":"#REF!"},{"$error":"#REF!"},{"$error":"#REF!"},{"$error":"#REF!"}]
[null,null,"00:00:00",{"$error":"#REF!"},{"$error":"#REF!"},{"$error":"#REF!"},{"$error":"#REF!"},{"$error":"#REF!"},{"$error":"#REF!"},{"$error":"#REF!"},{"$error":"#REF!"},{"$error":"#REF!"},{"$error":"#REF!"},{"$error":"#REF!"}]
[null,null,"00:00:00",{"$error":"#REF!"},{"$error":"#REF!"},{"$error":"#REF!"},{"$error":"#REF!"},{"$error":"#REF!"},{"$error":"#REF!"},{"$error":"#REF!"},{"$error":"#REF!"},{"$error":"#REF!"},{"$error":"#REF!"},{"$error":"#REF!"}]
[null,null,"00:00:00",{"$error":"#REF!"},{"$error":"#REF!"},{"$error":"#REF!"},{"$error":"#REF!"},{"$error":"#REF!"},{"$error":"#REF!"},{"$error":"#REF!"},{"$error":"#REF!"},{"$error":"#REF!"},{"$error":"#REF!"},{"$error":"#REF!"}]
[null,null,"00:00:00",{"$error":"#REF!"},{"$error":"#REF!"},{"$error":"#REF!"},{"$error":"#REF!"},{"$error":"#REF!"},{"$error":"#REF!"},{"$error":"#REF!"},{"$error":"#REF!"},{"$error":"#REF!"},{"$error":"#REF!"},{"$error":"#REF!"}]
[null,null,"00:00:00",{"$error":"#REF!"},{"$error":"#REF!"},{"$error":"#REF!"},{"$error":"#REF!"},{"$error":"#REF!"},{"$error":"#REF!"},{"$error":"#REF!"},{"$error":"#REF!"},{"$error":"#REF!"},{"$error":"#REF!"},{"$error":"#REF!"}]
[null,null,"00:00:00",{"$error":"#REF!"},{"$error":"#REF!"},{"$error":"#REF!"},{"$error":"#REF!"},{"$error":"#REF!"},{"$error":"#REF!"},{"$error":"#REF!"},{"$error":"#REF!"},{"$error":"#REF!"},{"$error":"#REF!"},{"$error":"#REF!"}]
[null,null,"00:00:00",{"$error":"#REF!"},{"$error":"#REF!"},{"$error":"#REF!"},{"$error":"#REF!"},{"$error":"#REF!"},{"$error":"#REF!"},{"$error":"#REF!"},{"$error":"#REF!"},{"$error":"#REF!"},{"$error":"#REF!"},{"$error":"#REF!"}]
[null,null,"00:00:00",{"$error":"#REF!"},{"$error":"#REF!"},{"$error":"#REF!"},{"$error":"#REF!"},{"$error":"#REF!"},{"$error":"#REF!"},{"$error":"#REF!"},{"$error":"#REF!"},{"$error":"#REF!"},{"$error":"#REF!"},{"$error":"#REF!"}]
[null,null,"00:00:00",{"$error":"#REF!"},{"$error":"#REF!"},{"$error":"#REF!"},{"$error":"#REF!"},{"$error":"#REF!"},{"$error":"#REF!"},{"$error":"#REF!"},{"$error":"#REF!"},{"$error":"#REF!"},{"$error":"#REF!"},{"$error":"#REF!"}]
[null,null,"00:00:00",{"$error":"#REF!"},{"$error":"#REF!"},{"$error":"#REF!"},{"$error":"#REF!"},{"$error":"#REF!"},{"$error":"#REF!"},{"$error":"#REF!"},{"$error":"#REF!"},{"$error":"#REF!"},{"$error":"#REF!"},{"$error":"#REF!"}]
[null,null,"00:00:00",{"$error":"#REF!"},{"$error":"#REF!"},{"$error":"#REF!"},{"$error":"#REF!"},{"$error":"#REF!"},{"$error":"#REF!"},{"$error":"#REF!"},{"$error":"#REF!"},{"$error":"#REF!"},{"$error":"#REF!"},{"$error":"#REF!"}]
[null,null,"00:00:00",{"$error":"#REF!"},{"$error":"#REF!"},{"$error":"#REF!"},{"$error":"#REF!"},{"$error":"#REF!"},{"$error":"#REF!"},{"$error":"#REF!"},{"$error":"#REF!"},{"$error":"#REF!"},{"$error":"#REF!"},{"$error":"#REF!"}]
[null,null,"00:00:00",{"$error":"#REF!"},{"$error":"#REF!"},{"$error":"#REF!"},{"$error":"#REF!"},{"$error":"#REF!"},{"$error":"#REF!"},{"$error":"#REF!"},{"$error":"#REF!"},{"$error":"#REF!"},{"$error":"#REF!"},{"$error":"#REF!"}]
[null,null,"00:00:00",{"$error":"#REF!"},{"$error":"#REF!"},{"$error":"#REF!"},{"$error":"#REF!"},{"$error":"#REF!"},{"$error":"#REF!"},{"$error":"#REF!"},{"$error":"#REF!"},{"$error":"#REF!"},{"$error":"#REF!"},{"$error":"#REF!"}]
[null,null,"00:00:00",{"$error":"#REF!"},{"$error":"#REF!"},{"$error":"#REF!"},{"$error":"#REF!"},{"$error":"#REF!"},{"$error":"#REF!"},{"$error":"#REF!"},{"$error":"#REF!"},{"$error":"#REF!"},{"$error":"#REF!"},{"$error":"#REF!"}]
[null,null,"00:00:00",{"$error":"#REF!"},{"$error":"#REF!"},{"$error":"#REF!"},{"$error":"#REF!"},{"$error":"#REF!"},{"$error":"#REF!"},{"$error":"#REF!"},{"$error":"#REF!"},{"$error":"#REF!"},{"$error":"#REF!"},{"$error":"#REF!"}]
[null,null,"00:00:00",{"$error":"#REF!"},{"$error":"#REF!"},{"$error":"#REF!"},{"$error":"#REF!"},{"$error":"#REF!"},{"$error":"#REF!"},{"$error":"#REF!"},{"$error":"#REF!"},{"$error":"#REF!"},{"$error":"#REF!"},{"$error":"#REF!"}]
[null,null,"00:00:00",{"$error":"#REF!"},{"$error":"#REF!"},{"$error":"#REF!"},{"$error":"#REF!"},{"$error":"#REF!"},{"$error":"#REF!"},{"$error":"#REF!"},{"$error":"#REF!"},{"$error":"#REF!"},{"$error":"#REF!"},{"$error":"#REF!"}]
[null,null,"00:00:00",{"$error":"#REF!"},{"$error":"#REF!"},{"$error":"#REF!"},{"$error":"#REF!"},{"$error":"#REF!"},{"$error":"#REF!"},{"$error":"#REF!"},{"$error":"#REF!"},{"$error":"#REF!"},{"$error":"#REF!"},{"$error":"#REF!"}]
[null,null,"00:00:00",{"$error":"#REF!"},{"$error":"#REF!"},{"$error":"#REF!"},{"$error":"#REF!"},{"$error":"#REF!"},{"$error":"#REF!"},{"$error":"#REF!"},{"$error":"#REF!"},{"$error":"#REF!"},{"$error":"#REF!"},{"$error":"#REF!"}]
[null,null,"00:00:00",{"$error":"#REF!"},{"$error":"#REF!"},{"$error":"#REF!"},{"$error":"#REF!"},{"$error":"#REF!"},{"$error":"#REF!"},{"$error":"#REF!"},{"$error":"#REF!"},{"$error":"#REF!"},{"$error":"#REF!"},{"$error":"#REF!"}]
[null,null,"00:00:00",{"$error":"#REF!"},{"$error":"#REF!"},{"$error":"#REF!"},{"$error":"#REF!"},{"$error":"#REF!"},{"$error":"#REF!"},{"$error":"#REF!"},{"$error":"#REF!"},{"$error":"#REF!"},{"$error":"#REF!"},{"$error":"#REF!"}]
[null,null,"00:00:00",{"$error":"#REF!"},{"$error":"#REF!"},{"$error":"#REF!"},{"$error":"#REF!"},{"$error":"#REF!"},{"$error":"#REF!"},{"$error":"#REF!"},{"$error":"#REF!"},{"$error":"#REF!"},{"$error":"#REF!"},{"$error":"#REF!"}]
[null,null,"00:00:00",{"$error":"#REF!"},{"$error":"#REF!"},{"$error":"#REF!"},{"$error":"#REF!"},{"$error":"#REF!"},{"$error":"#REF!"},{"$error":"#REF!"},{"$error":"#REF!"},{"$error":"#REF!"},{"$error":"#REF!"},{"$error":"#REF!"}]
[null,null,"00:00:00",{"$error":"#REF!"},{"$error":"#REF!"},{"$error":"#REF!"},{"$error":"#REF!"},{"$error":"#REF!"},{"$error":"#REF!"},{"$error":"#REF!"},{"$error":"#REF!"},{"$error":"#REF!"},{"$error":"#REF!"},{"$error":"#REF!"}]
[null,null,"00:00:00",{"$error":"#REF!"},{"$error":"#REF!"},{"$error":"#REF!"},{"$error":"#REF!"},{"$error":"#REF!"},{"$error":"#REF!"},{"$error":"#REF!"},{"$error":"#REF!"},{"$error":"#REF!"},{"$error":"#REF!"},{"$error":"#REF!"}]
[null,null,"00:00:00",{"$error":"#REF!"},{"$error":"#REF!"},{"$error":"#REF!"},{"$error":"#REF!"},{"$error":"#REF!"},{"$error":"#REF!"},{"$error":"#REF!"},{"$error":"#REF!"},{"$error":"#REF!"},{"$error":"#REF!"},{"$error":"#REF!"}]
[null,null,"00:00:00",{"$error":"#REF!"},{"$error":"#REF!"},{"$error":"#REF!"},{"$error":"#REF!"},{"$error":"#REF!"},{"$error":"#REF!"},{"$error":"#REF!"},{"$error":"#REF!"},{"$error":"#REF!"},{"$error":"#REF!"},{"$error":"#REF!"}]
[null,null,"00:00:00",{"$error":"#REF!"},{"$error":"#REF!"},{"$error":"#REF!"},{"$error":"#REF!"},{"$error":"#REF!"},{"$error":"#REF!"},{"$error":"#REF!"},{"$error":"#REF!"},{"$error":"#REF!"},{"$error":"#REF!"},{"$error":"#REF!"}]
[null,null,"00:00:00",{"$error":"#REF!"},{"$error":"#REF!"},{"$error":"#REF!"},{"$error":"#REF!"},{"$error":"#REF!"},{"$error":"#REF!"},{"$error":"#REF!"},{"$error":"#REF!"},{"$error":"#REF!"},{"$error":"#REF!"},{"$error":"#REF!"}]
[null,null,"00:00:00",{"$error":"#REF!"},{"$error":"#REF!"},{"$error":"#REF!"},{"$error":"#REF!"},{"$error":"#REF!"},{"$error":"#REF!"},{"$error":"#REF!"},{"$error":"#REF!"},{"$error":"#REF!"},{"$error":"#REF!"},{"$error":"#REF!"}]
[null,null,"00:00:00",{"$error":"#REF!"},{"$error":"#REF!"},{"$error":"#REF!"},{"$error":"#REF!"},{"$error":"#REF!"},{"$error":"#REF!"},{"$error":"#REF!"},{"$error":"#REF!"},{"$error":"#REF!"},{"$error":"#REF!"},{"$error":"#REF!"}]
[null,null,"00:00:00",{"$error":"#REF!"},{"$error":"#REF!"},{"$error":"#REF!"},{"$error":"#REF!"},{"$error":"#REF!"},{"$error":"#REF!"},{"$error":"#REF!"},{"$error":"#REF!"},{"$error":"#REF!"},{"$error":"#REF!"},{"$error":"#REF!"}]
[null,null,"00:00:00",{"$error":"#REF!"},{"$error":"#REF!"},{"$error":"#REF!"},{"$error":"#REF!"},{"$error":"#REF!"},{"$error":"#REF!"},{"$error":"#REF!"},{"$error":"#REF!"},{"$error":"#REF!"},{"$error":"#REF!"},{"$error":"#REF!"}]
[null,null,"00:00:00",{"$error":"#REF!"},{"$error":"#REF!"},{"$error":"#REF!"},{"$error":"#REF!"},{"$error":"#REF!"},{"$error":"#REF!"},{"$error":"#REF!"},{"$error":"#REF!"},{"$error":"#REF!"},{"$error":"#REF!"},{"$error":"#REF!"}]
[null,null,"00:00:00",{"$error":"#REF!"},{"$error":"#REF!"},{"$error":"#REF!"},{"$error":"#REF!"},{"$error":"#REF!"},{"$error":"#REF!"},{"$error":"#REF!"},{"$error":"#REF!"},{"$error":"#REF!"},{"$error":"#REF!"},{"$error":"#REF!"}]
[null,null,"00:00:00",{"$error":"#REF!"},{"$error":"#REF!"},{"$error":"#REF!"},{"$error":"#REF!"},{"$error":"#REF!"},{"$error":"#REF!"},{"$error":"#REF!"},{"$error":"#REF!"},{"$error":"#REF!"},{"$error":"#REF!"},{"$error":"#REF!"}]
[null,null,"00:00:00",{"$error":"#REF!"},{"$error":"#REF!"},{"$error":"#REF!"},{"$error":"#REF!"},{"$error":"#REF!"},{"$error":"#REF!"},{"$error":"#REF!"},{"$error":"#REF!"},{"$error":"#REF!"},{"$error":"#REF!"},{"$error":"#REF!"}]
[null,null,"00:00:00",{"$error":"#REF!"},{"$error":"#REF!"},{"$error":"#REF!"},{"$error":"#REF!"},{"$error":"#REF!"},{"$error":"#REF!"},{"$error":"#REF!"},{"$error":"#REF!"},{"$error":"#REF!"},{"$error":"#REF!"},{"$error":"#REF!"}]
[null,null,"00:00:00",{"$error":"#REF!"},{"$error":"#REF!"},{"$error":"#REF!"},{"$error":"#REF!"},{"$error":"#REF!"},{"$error":"#REF!"},{"$error":"#REF!"},{"$error":"#REF!"},{"$error":"#REF!"},{"$error":"#REF!"},{"$error":"#REF!"}]
[null,null,"00:00:00",{"$error":"#REF!"},{"$error":"#REF!"},{"$error":"#REF!"},{"$error":"#REF!"},{"$error":"#REF!"},{"$error":"#REF!"},{"$error":"#REF!"},{"$error":"#REF!"},{"$error":"#REF!"},{"$error":"#REF!"},{"$error":"#REF!"}]
[null,null,{"$f":"B1122","v":"00:00:00"},{"$error":"#REF!"},{"$error":"#REF!"},{"$f":"+$C$80+$H$80","v":{"$error":"#REF!"}},{"$f":"+$C$78+$H$78","v":{"$error":"#REF!"}},{"$f":"+$C$76+$C$84","v":{"$error":"#REF!"}},{"$f":"D1122-E1122-F1122-G1122-H1122","v":{"$error":"#REF!"}},{"$error":"#REF!"},{"$error":"#REF!"},{"$error":"#REF!"},{"$error":"#REF!"},{"$f":"M1122-K1122","v":{"$error":"#REF!"}}]

{"sheet":"Resultat1","index":8,"n_rows":41,"n_cols":10,"rows_kept":41,"cut":false,"hidden":false,"merged":[[9,6,9,7],[38,2,38,6],[19,3,19,4],[16,0,16,2],[16,3,16,4],[18,0,18,4],[18,6,18,9],[29,7,29,8],[22,3,22,4],[22,7,22,8],[23,7,23,8],[24,0,24,4],[24,7,24,8],[25,7,25,8],[21,3,21,4],[21,7,21,8],[26,7,26,8],[27,7,27,8],[28,7,28,8],[19,7,19,8],[20,3,20,4],[20,7,20,8],[14,0,14,2],[14,3,14,4],[14,6,14,8],[15,0,15,2],[11,6,11,9],[12,0,12,2],[12,3,12,4],[12,6,12,8],[13,0,13,2],[13,3,13,4],[13,6,13,8],[1,0,2,8],[3,0,4,8],[40,0,40,9],[6,1,6,4],[7,1,7,4],[6,6,6,7],[6,8,6,9],[8,1,8,4],[7,6,7,7],[7,8,7,9],[9,1,9,4],[8,6,8,7],[8,8,8,9],[15,3,15,4],[15,6,15,8],[11,0,11,4]]}
[]
[" NEREM"]
[]
["SIMULATION INDIVIDUELLE"]
[]
[]
["Nom et prénoms",{"$f":"'Module '!D14","v":"LASSEY BEN"},null,null,null,null,"Lieu Naissance",null,{"$f":"'Module '!D18","v":"LOME"}]
["Date Naissance",{"$f":"'Module '!D16","v":"1980-12-18"},null,null,null,null,"Employeur",null,{"$f":"'Module '!H16","v":"GTAC2A-VIE"}]
["Profession",{"$f":"'Module '!H14","v":"CADRE DE BANQUE"},null,null,null,null,"Téléphone",null,{"$f":"'Module '!D20","v":90114488}]
["Adresse",{"$f":"'Module '!H18","v":"BP/331"},null,null,null,null,"E-mail",null,{"$f":"'Module '!H20","v":"ben@yahoo.fr"}]
[]
["Conditions de couverture",null,null,null,null,null,"Conditions paiment Prime"]
["Effet Couverture",null,null,{"$f":"'Module '!D26:F26","v":"2016-12-07"},null,null,"Date premier paiement",null,null,{"$f":"D13","v":"2016-12-07"}]
["Durée de couverture (années)",null,null,{"$f":"'calcu '!$K$27-(YEAR(D13)-YEAR(B8))+5","v":24},null,null,"Durée Paiement (années)",null,null,{"$f":"D14","v":24}]
["Date échéance",null,null,{"$f":"DATE(YEAR(D13)+D14,MONTH(D13),DAY(D13)-1)","v":"2040-12-06"},null,null,"Périodicité Prime (1=An; 2=Sem; 4=Trim; 12=Mois)",null,null,12]
["Montant mensuel de la pension",null,null,{"$f":"'Module '!D28:F28","v":100000},null,null,"Date Dernière prime",null,null,{"$f":"DATE(YEAR(D13)+D14,MONTH(D13)-1,DAY(D13))","v":"2040-11-07"}]
["Durée de service de la pension (mois)",null,null,{"$f":"'Module '!$D$30:$F$30","v":36}]
[]
["Evaluation de la prime commerciale",null,null,null,null,null,"Evolution du Compte constitutif de la pension"]
["Libellé","Montant","Périodicité","Observations",null,null,"Année","Cumul Cotisations",null,"Valeur Liquidation"]
["Prime constitutive pension",{"$f":"'calcu '!C15","v":8885},{"$f":"IF(per_prime=1,\"Annuelle\",IF(per_prime=2,\"Semestrielle\",IF(per_prime=4,\"Trimestrielle\",IF(per_prime=12,\"Mensuelle\"))))","v":"Mensuelle"},null,null,null,{"$f":"IF(D14>=1,1,\"\")","v":1},{"$f":"IF(G21=\"\",\"\",VLOOKUP(G21*12,'calcu '!$A$26:$F$1036,3,FALSE))","v":106620},null,{"$f":"IF(G21=\"\",\"\",VLOOKUP(G21*12,'calcu '!$A$26:$F$1036,5,FALSE))","v":93421.191425798112}]
["Prime Décès",{"$f":"D16*6*'calcu '!B3/12*1.03*1.04","v":389.38120000000004},{"$f":"IF(per_prime=1,\"Annuelle\",IF(per_prime=2,\"Semestrielle\",IF(per_prime=4,\"Trimestrielle\",IF(per_prime=12,\"Mensuelle\"))))","v":"Mensuelle"},null,null,null,{"$f":"IF(D14>=2,2,\"\")","v":2},{"$f":"IF(G22=\"\",\"\",VLOOKUP(G22*12,'calcu '!$A$26:$F$1036,3,FALSE))","v":213240},null,{"$f":"IF(G22=\"\",\"\",VLOOKUP(G22*12,'calcu '!$A$26:$F$1036,5,FALSE))","v":190112.1245514992}]
["Prime totale",{"$f":"SUM(B21:B22)","v":9274.3811999999998},{"$f":"IF(per_prime=1,\"Annuelle\",IF(per_prime=2,\"Semestrielle\",IF(per_prime=4,\"Trimestrielle\",IF(per_prime=12,\"Mensuelle\"))))","v":"Mensuelle"},null,null,null,{"$f":"IF(D14>=3,3,\"\")","v":3},{"$f":"IF(G23=\"\",\"\",VLOOKUP(G23*12,'calcu '!$A$26:$F$1036,3,FALSE))","v":319860},null,{"$f":"IF(G23=\"\",\"\",VLOOKUP(G23*12,'calcu '!$A$26:$F$1036,5,FALSE))","v":290187.24033659982}]
[null,null,null,null,null,null,{"$f":"IF(D14>=4,4,\"\")","v":4},{"$f":"IF(G24=\"\",\"\",VLOOKUP(G24*12,'calcu '!$A$26:$F$1036,3,FALSE))","v":426480},null,{"$f":"IF(G24=\"\",\"\",VLOOKUP(G24*12,'calcu '!$A$26:$F$1036,5,FALSE))","v":393764.9851741789}]
["Résumé synoptique",null,null,null,null,null,{"$f":"IF(D14>=5,5,\"\")","v":5},{"$f":"IF(G25=\"\",\"\",VLOOKUP(G25*12,'calcu '!$A$26:$F$1036,3,FALSE))","v":533100},null,{"$f":"IF(G25=\"\",\"\",VLOOKUP(G25*12,'calcu '!$A$26:$F$1036,5,FALSE))","v":500967.95108107338}]
["Rubriques","Montant Périodique","Périodicité","Durée (ans)","Montant cumulé",null,{"$f":"IF(D14>=6,6,\"\")","v":6},{"$f":"IF(G26=\"\",\"\",VLOOKUP(G26*12,'calcu '!$A$26:$F$1036,3,FALSE))","v":639720},null,{"$f":"IF(G26=\"\",\"\",VLOOKUP(G26*12,'calcu '!$A$26:$F$1036,5,FALSE))","v":611923.02079470921}]
["Prime constitutive Pension",{"$f":"B21","v":8885},{"$f":"IF(per_prime=1,\"Annuelle\",IF(per_prime=2,\"Semestrielle\",IF(per_prime=4,\"Trimestrielle\",IF(per_prime=12,\"Mensuelle\"))))","v":"Mensuelle"},{"$f":"D14","v":24},{"$f":"B27*D27*$J$15","v":2558880},null,{"$f":"IF(D14>=7,7,\"\")","v":7},{"$f":"IF(G27=\"\",\"\",VLOOKUP(G27*12,'calcu '!$A$26:$F$1036,3,FALSE))","v":746340},null,{"$f":"IF(G27=\"\",\"\",VLOOKUP(G27*12,'calcu '!$A$26:$F$1036,5,FALSE))","v":726761.51794832235}]
["Prime Décès",{"$f":"B22","v":389.38120000000004},{"$f":"IF(per_prime=1,\"Annuelle\",IF(per_prime=2,\"Semestrielle\",IF(per_prime=4,\"Trimestrielle\",IF(per_prime=12,\"Mensuelle\"))))","v":"Mensuelle"},{"$f":"D14","v":24},{"$f":"B28*D28*$J$15","v":112141.7856},null,{"$f":"IF(D14>=8,8,\"\")","v":8},{"$f":"IF(G28=\"\",\"\",VLOOKUP(G28*12,'calcu '!$A$26:$F$1036,3,FALSE))","v":852960},null,{"$f":"IF(G28=\"\",\"\",VLOOKUP(G28*12,'calcu '!$A$26:$F$1036,5,FALSE))","v":845619.36250231182}]
["Pension de base(*)",{"$f":"D16","v":100000},"Mensuelle",{"$f":"D17","v":36},{"$f":"B29*D29","v":3600000},null,{"$f":"IF(D14>=9,9,\"\")","v":9},{"$f":"IF(G29=\"\",\"\",VLOOKUP(G29*12,'calcu '!$A$26:$F$1036,3,FALSE))","v":959580},null,{"$f":"IF(G29=\"\",\"\",VLOOKUP(G29*12,'calcu '!$A$26:$F$1036,5,FALSE))","v":968637.2316156911}]
["Pension de base + PB attendues(*)",{"$f":"'calcu '!$L$10","v":106871.50129718106},"Mensuelle",{"$f":"D17","v":36},{"$f":"B30*D30","v":3847374.0466985181},null,{"$f":"IF(D14>=10,10,\"\")","v":10},{"$f":"IF(G30=\"\",\"\",VLOOKUP(G30*12,'calcu '!$A$26:$F$1036,3,FALSE))","v":1066200},null,{"$f":"IF(G30=\"\",\"\",VLOOKUP(G30*12,'calcu '!$A$26:$F$1036,5,FALSE))","v":1095960.7261480389}]
[]
[null,"(*)  La durée de service de la rente  est exprimée en mois"]
[null,"(**)  Le gain ci-dessus communiqué sera amélioré par les evantuelles participations aux bénéfices distribuées à la fin de chaque année"]
[]
[]
[]
[]
[]
[null,null,"CE DOCUMENT N'EST PAS CONTRACTUEL ET EST ETABLI A TITRE INDICATIF"]
[]
["Nerem BTCI est un Produit Bancassurance de la BTCI et de  GTAC2A-VIE "]

{"sheet":"Feuil2","index":9,"n_rows":70,"n_cols":23,"rows_kept":70,"cut":false,"hidden":true,"merged":[[32,1,32,10],[3,1,3,10],[4,1,4,10]]}
["age","age calcul","intnom","escnom","alpham","betam",null,null,"Factprime","intper_ajs","escper_ajs","factper","PUP_DEC",null,"PUI_DEC","PUC_DEC","PAC_DEC","PUP_SURV","PUI_SURV","PUC_SURV","PAC_SURV","PAC_TOTAL","PAI_TOTAL"]
[{"$f":"YEAR(effet)-YEAR(dat_nais)","v":41},{"$f":"IF(age<=fintranche1,agetranche1,IF(AND(age>=debtranche2,age<=fintranche2),agetranche2,IF(AND(age>=debtranche3,age<=fintranche3),agetranche3,IF(AND(age>=debtranche4,age<=fintranche4),agetranche4,IF(AND(age>=debtranche5,age<=fintranche5),agetranche5,IF(age>=detranche6,agetranche6))))))","v":43},{"$f":"per_prime*((1+int)^(1/per_prime)-1)","v":3.4450784628919706E-2},{"$f":"per_prime*(1-(1+int)^(-1/per_prime))","v":3.435216304802724E-2},{"$f":"(int*tauxesc)/(intnom*escnom)","v":1.0000979404650285},{"$f":"(int-intnom)/(intnom*escnom)","v":0.46407639358470321},null,null,{"$f":"(alpham*(VLOOKUP((agetarif+viel),table,14,FALSE)-VLOOKUP((agetarif+viel+dur_pmt),table,14,FALSE))-betam*(VLOOKUP((agetarif+viel),table,10,FALSE)-VLOOKUP((agetarif+viel+dur_pmt),table,10,FALSE)))/VLOOKUP((agetarif+viel),table,10,FALSE)","v":12.891042463337648},{"$f":"(1+intnet)^(1/per_prime)-1","v":2.8708987190766422E-3},{"$f":"1-(1+intnet)^(-1/per_prime)","v":2.86268025400227E-3},{"$f":"(1-invintnet)/(per_prime*escper_ajs)","v":0.98440453585105081},{"$f":"bourse*duréedec*tauxindemdec*(VLOOKUP((agetarif+viel),table,12,FALSE)-VLOOKUP((agetarif+viel+durée),table,12,FALSE))/VLOOKUP((agetarif+viel),table,10,FALSE)","v":92395.080324575261},null,{"$f":"PUP_DEC+(tauxgestprime+tauxgestencais)*PUC_DEC","v":104213.05571492792},{"$f":"PUP_DEC/(1-tauxgestprime-tauxgestencais-tauxacquiprime)","v":107436.13991229683},{"$f":"+PUC_DEC/Factprime","v":8334.1700423256771},{"$f":"bourse*(1+intnet)^(-durée)*PV(intmens_ajs,durservbourseAnc,-1,,1)","v":913842.06699511979},{"$f":"(1+tauxgestrente)*PUP_SURV+fixgest+(tauxgestprime+tauxgestencais)*PUC_SURV","v":1030728.8430061236},{"$f":"((1+tauxgestrente)*PUP_SURV+fixgest)/(1-tauxgestprime-tauxgestencais-tauxacquiprime)","v":1062607.0546454883},{"$f":"PUC_SURV/PV(intnet,dur_pmt,-1,,1)","v":74885.89773042938},{"$f":"PAC_DEC+PAC_SURV","v":83220.06777275505},{"$f":"+PUI_DEC/Factprime+PUI_SURV/PV(intnet,dur_pmt,-1,,1)","v":80723.465739572406}]
[]
[]
[]
[]
[]
[]
[]
[]
[]
[]
[]
[]
[]
[]
[]
[]
[]
[]
[]
[]
[]
[]
[]
[]
[]
[]
[]
[]
[]
[]
[null,"(*) La durée de service de la pension est exprimée en mois"]
[]
[]
[]
[]
[]
[null,"0;002870899"]
[null,30,null,1997815.9893939265]
[null,36,null,{"$f":"PV(0.002870899,18,100000,-1,1)","v":-1756861.6238037951}]
[null,{"$f":"PV(B39,B40,B41,-1,1)","v":{"$error":"#VALUE!"}}]
[null,null,null,{"$f":"(D40/D41)*100000","v":-113715.04518770461}]
[null,{"$f":"PV(B39,B41,B41,-1,1)","v":{"$error":"#VALUE!"}}]
[null,null,null,{"$f":"D40/D41","v":-1.1371504518770461}]
[]
[]
[]
[null,null,"RefPens","ValRefPens"]
[null,null,1,12]
[null,null,2,18]
[null,null,3,24]
[null,null,4,30]
[null,null,5,36]
[]
[]
[null,null,3,{"$f":"LOOKUP(C57,C50:D54)","v":24}]
[]
[]
[]
[]
[]
[]
[]
[]
[null,null,null,null,null,12]
[null,null,null,null,null,18]
[null,null,null,null,null,24]
[null,null,null,null,null,30]
[null,null,null,null,null,36]